{"text_format":"1","workbook":"xlsx","n_sheets":45,"sheets":["Quick guide","Start","Questions","Year","Process Updates","Graphs","April","Apr-Raw","Apr-Data","May","May-Raw","May-Data","June","June-Raw","June-Data","July","July-Raw","July-Data","Aug","Aug-Raw","Aug-Data","Sept","Sept-Raw","Sept-Data","Oct","Oct-Raw","Oct-Data","Nov","Nov-Raw","Nov-Data","Dec","Dec-Raw","Dec-Data","Jan","Jan-Raw","Jan-Data","Feb","feb-Raw","feb-Data","March","march-Raw","Export","march-Data","Q","Math"],"not_rendered":{"charts":3,"images":13,"macros":1,"external_links":0,"defined_names":3,"comments":0,"pivot_tables":0},"unopened":[],"bounds":{"document_bytes":16777216,"sheet_cells":100000,"rows_first":2000,"rows_last":500,"rows_between":2000,"halvings":0,"cell_chars":16384,"cell_head_chars":4096},"cells_cut":0,"cells_raw":0,"read":"whole","date_system":"1900"}

{"sheet":"Quick guide","index":0,"n_rows":364,"n_cols":6,"rows_kept":364,"cut":false,"hidden":false,"merged":[[327,0,327,6]]}
[]
["About"]
["Hi! This guide is designed to help you get the most of this Quality monitoring tool. it will cover the basis of how to use it along with a few other tips"]
["This tool was designed to help remove all the irritating mathematics involved in audits and make things easier for all involved."]
["it also helps standardise how we complete audits in the department."]
["The following menu is hyperlinked to the relevant section, click on what you need to know."]
[]
["1. Using the sheet for the first time"]
["2. General information"]
["3. Setting up the questions"]
["4. Setting the audit month"]
["5. filling in the audit"]
["6. view results - by month"]
["7. View the raw data"]
["8. view results - for the year"]
["9. Graph stuff"]
["10. Create a report/export"]
["11. Other information"]
["12. Adding audits/Questions to the sheet"]
[]
["1. Using the sheet for the first time"]
["Please ensure you make a fresh copy of it in the relevant Audit folder - please do not use the original!"]
["The first time you activate this sheet, please ensure you have activated Macros and made it a trusted document if asked."]
[]
[]
[]
[]
[]
[]
["2. General information"]
["The Quality monitoring tool (QM tool from now) has quite a few tabs."]
[null,"Tabs with this colour contain consolidated information for all the audits"]
[null,"These tabs have result breakdowns for the labelled month"]
[null,"this is involved with creating reports, just ignore it"]
[null,"These tabs (this included) have information & settings type stuff"]
[null,"These tabs go into greater detail for results, they're hidden to start with."]
[null,"If you've found these please leave them alone, they get cranky if disturbed."]
[]
["3. Setting up the questions"]
["by the time you come to use the QM tool you will have (hopefully) drafted your questions and have had them added to the question bank."]
["If you haven't done that, please do it now or you wont get much use out of this."]
["With your questions prepped you need to populate the sheet for your audit (if it hasn't been done already)"]
["go to the 'Start' tab and click on 'open menu'"]
["This menu will appear:"]
[]
[]
[]
[]
[]
[]
[]
[]
[]
[]
[]
[]
[]
[]
[]
["From the 'select QM audit' drop down select the audit you need"]
["now click 'populate questions'"]
["the audit will do some fun stuff and a message will appear saying:"]
[]
[]
[]
[]
[]
[]
[]
[]
[]
[]
[]
[]
[]
[]
[]
[]
["click 'ok' and get ready for the next step…"]
[]
["4. Setting the audit month"]
[]
["On that same menu you will need to set the month you are collecting data for"]
[]
[]
[]
[]
[]
[]
[]
[]
[]
[]
[]
[]
[]
[]
["Click on the drop down next to 'select data collection month' & choose the month you need."]
["the month will set as soon as its selected, so its quite wasn't to change if you have the wrong one."]
["Please make sure you change the month before you start collecting information for a new one, otherwise your data will get mixed up."]
["now you're ready to start the audit…"]
[]
["5. filling in the audit"]
["You can access the data collection screen through the previously mentioned menu (by clicking 'Start QM audit')"]
["Or through the 'continue in current data collection month' button on the start tab"]
["when you do that, the follow menu will appear:"]
[]
[]
[]
[]
[]
[]
[]
[]
[]
[]
[]
[]
[]
[]
[]
[]
[]
[]
[]
[]
[]
[]
[]
[]
[]
[]
[]
[]
[]
[]
[]
[]
["It will look like this but have your questions listed."]
["You can navigate through the questions by either clicking on the 'next page' button (and previous page button on subsequent pages) Or by clicking on the page number tabs."]
["You can exit by clicking cancel/exit towards the bottom."]
[]
["The first thing you need to do is record the patients K number. If you are doing an audit which doesn’t involve patients you will need an identifier for which 'record' this is"]
["You cannot submit information without there being some kind of identifier in this box"]
["For Audits involving patients information/files you can then proceed to fill in the other boxes. You should know if you need to collect this data before starting your Audit."]
["After this you get to the questions proper."]
["The QM Tool is mainly designed to record 'compliance' questions. This is where something was or wasn't done, or in some cases was not applicable."]
["There is also the option to say 'No - Justified', this is where something hasn’t complied but there was a good reason for it."]
["The compliance options can be found next to each question in the 'compliance' column"]
[]
[]
[]
[]
[]
[]
[]
[]
[]
["Other questions may need you to record a non-compliance result. For this kind of question the result goes in the 'other result' box."]
["in these instances you can leave the compliance box empty (unless its asking for more detail on the result!)"]
[]
[]
[]
[]
[]
[]
[]
[]
["its worth noting that results that go into 'other result' have absolutely no influence on the results produced by the QM Tool"]
[]
["Each page of this menu has up to 10 questions, so please make sure you have checked they're all answered before submitting the data. Pages without questions will hide automatically"]
["on the last page you will find a box for any additional notes you may have for this record."]
[]
[]
[]
[]
[]
[]
[]
[]
[]
[]
[]
[]
[]
[]
[]
[]
[]
["once everything is done, click 'submit results' at the bottom. This will save your information"]
["If you have missed any questions they will be highlighted before you can finish the submission."]
[]
[]
[]
[]
[]
[]
[]
[]
[]
[]
["the menu will now re-appear ready for your next entry. "]
["once you have completed all your entries for the month click 'cancel/Exit'"]
["if you haven't finished all your data entries for the month, don’t worry, you can come back to it."]
["you can keep adding to it until you change the audit collection month."]
[]
["6. view results - by month"]
["Now you have completed your Audit for the month you can go look at the results."]
["click on the relevant month tab & you will see something like this:"]
[]
[]
[]
[]
[]
[]
[]
[]
[]
[]
[]
[]
[]
[]
[]
["The sheet gives a breakdown of each compliance answer against the question. "]
["If you have a specific compliance target set, the overall result (compliant & justified) will highlight if its meeting or not meeting it."]
["Otherwise the highlights will go off the 'traffic lights' (again if set)"]
["You can also enter the date the audit was completed & who by - which is useful if several people are responsible for the audit."]
["The sample group size fills in automatically."]
[]
["if you have been recording the type of appointment (New of follow-up) you will also get the information of how many pts had that description"]
["If you have been recording the appointment code and type it in you can see how many of your sample group attended that clinic."]
[]
["7. View the raw data"]
["If you have recorded non-compliance results, or need to tweak a submission after it has been completed, you will need to access the raw audit data."]
["to do this, go back to the audit menu mentioned in step 3."]
[]
[]
[]
[]
[]
[]
[]
[]
[]
[]
[]
[]
[]
[]
["click on 'view raw data' and the raw data tabs will be revealed."]
[]
[]
[]
[]
[]
[]
[]
[]
[]
[]
[]
[]
[]
[]
[]
[]
[]
[]
["click on the tab you need & you will see something similar to this:"]
[]
[]
[]
[]
[]
[]
[]
[]
[]
[]
[]
[]
[]
[]
["There are drop downs in each compliance column should you need to change a result (this prevents the math being broken)"]
["the raw data tabs will hide again when you close the QM tool."]
[]
["8. view results - for the year"]
["for regular/monthly audits you may want to view the results for the year to help identify any trends. You can do this through the 'year' tab"]
["This provides the full results breakdown for each question across the year."]
["As with the month tab, the overall results will highlight against any specific targets if set, if not they will go against the 'traffic lights' (if set)"]
[]
["9. Graph stuff"]
["The 'graphs' tab takes information from the 'year' tab and puts it into a more visual medium."]
["To get the best use of these, its recommended you re-configure the graphs through their filter & de-select any blanks"]
["they're originally set to show results for 40 questions, so if you only have 10 deselecting them will make the visual cleaner."]
[]
["10. Create a report/export"]
["After completing your audit you may want to generate a report which details your results."]
["The QM tool can generate a report for you which will details current results and the previous months results (except on the April report)."]
["The report will be generated for your currently selected audit month, if you need it for a different one please amend as per section 4."]
["To generate the report, open the audit menu covered in section 4:"]
[]
[]
[]
[]
[]
[]
[]
[]
[]
[]
[]
[]
[]
[]
["Click on 'create audit report'. The QM tool will do some stuff and generate a new sheet with your report."]
["Your report is now good to go. Though you may want to delete any rows which have blank question spaces."]
[]
["11. Other information"]
["what follows are some useful tips on getting the best out of this tool:"]
["1. make sure your questions make sense and have yes/no/an answers, it’s a good idea to test them out a couple of times before committing to them for the year"]
["2. make sure your questions aren't too long. There is limited space in the data collection menu, questions that are too long just wont show up"]
["3. don't be afraid to add extra graphs to the graph tab if you need to"]
["4. the sheet is made for one financial year run of an audit, at the end you'll need a new one. "]
[]
[]
["12. Adding audits/Questions"]
["Questions are added to the audit sheet through the 'Questions' Tab."]
["The sheet can hold a total of 50 audits with a max of 40 questions each."]
["Questions must be 'compliance' questions which can be answered 'Yes' or 'No'."]
[]
["To create an audit first add the name to the top row. These will say 'Filler' at first use:"]
[]
[]
[]
[null,null,null,null,null,">"]
[]
[null,null,null,null,null,">"]
[]
[null,null,null,null,null,">"]
[]
[null,null,null,null,null,">"]
[]
[null,null,null,null,null,">"]
[]
[null,null,null,null,null,">"]
[]
["Next add your questions:"]
[]
[]
[]
[]
[]
[]
[]
[]
[]
[]
[]
["You can also add individual percentage targets against each question if them have them."]
["Though the RAG rating used throughout this sheet goes against the percentages shown in the 'year' tab"]
[]
["Once all your questions are entered the audit is ready to use. You can populate the sheet by following section 3 of this guide."]

{"sheet":"Start","index":1,"n_rows":18,"n_cols":2,"rows_kept":18,"cut":false,"hidden":false,"merged":[[0,1,0,4],[1,1,1,4]]}
["Quality Monitoring Audit Title","BCHI - Assessments"]
["Current data collection month","May"]
[]
[]
[]
[]
[]
[]
[]
[]
[]
[]
["Audit tool V 3.5 (shareable)"]
[]
[]
[]
["© 2023 Nottingham University Hospitals Trust"]
["The copyright in this documentation is owned by Nottingham University Hospitals Trust and this documentation may not (except under a written licence granted by Nottingham University Hospitals Trust, strictly in accordance with that licence) be copied, stored on any electronic medium or transmitted over any electronic network, loaded into or stored in any computer, or reproduced in any other way."]

{"sheet":"Questions","index":2,"n_rows":42,"n_cols":101,"rows_kept":42,"cut":false,"hidden":true,"merged":[[0,93,0,94],[0,95,0,96],[0,97,0,98],[0,99,0,100],[0,81,0,82],[0,83,0,84],[0,85,0,86],[0,87,0,88],[0,89,0,90],[0,91,0,92],[0,31,0,32],[0,29,0,30],[0,15,0,16],[0,79,0,80],[0,57,0,58],[0,59,0,60],[0,61,0,62],[0,63,0,64],[0,65,0,66],[0,67,0,68],[0,69,0,70],[0,71,0,72],[0,73,0,74],[0,75,0,76],[0,77,0,78],[0,55,0,56],[0,45,0,46],[0,47,0,48],[0,49,0,50],[0,51,0,52],[0,33,0,34],[0,35,0,36],[0,37,0,38],[0,39,0,40],[0,41,0,42],[0,53,0,54],[0,0,1,0],[0,1,0,2],[0,3,0,4],[0,5,0,6],[0,7,0,8],[0,17,0,18],[0,19,0,20],[0,21,0,22],[0,27,0,28],[0,9,0,10],[0,11,0,12],[0,23,0,24],[0,25,0,26],[0,13,0,14],[0,43,0,44]]}
["QMA name:","Review audit",null,"BCHI - Assessments",null,"Filler 3",null,"Filler 4",null,"Filler 5",null,"Filler 6",null,"Filler 7",null,"Filler 8",null,"Filler 9",null,"Filler 10",null,"Filler 11",null,"Filler 12",null,"Filler 13",null,"Filler 14",null,"Filler 15",null,"Filler 16",null,"Filler 17",null,"Filler 18",null,"Filler 19",null,"Filler 20",null,"Filler 21",null,"Filler 22",null,"Filler 23",null,"Filler 24",null,"Filler 25",null,"Filler 26",null,"Filler 27",null,"Filler 28",null,"Filler 29",null,"Filler 30",null,"Filler 31",null,"Filler 32",null,"Filler 33",null,"Filler 34",null,"Filler 35",null,"Filler 36",null,"Filler 37",null,"Filler 38",null,"Filler 39",null,"Filler 40",null,"Filler 41",null,"Filler 42",null,"Filler 43",null,"Filler 44",null,"Filler 45",null,"Filler 46",null,"Filler 47",null,"Filler 48",null,"Filler 49",null,"Filler 50"]
[null,"questions","Target","questions","Target","questions","Target","questions","Target","questions","Target","questions","Target","questions","Target","questions","Target","questions","Target","questions","Target","questions","Target","questions","Target","Questions","Target","Questions","Target","Questions","Target","Questions","Target","questions","Target","questions","Target","questions","Target","questions","Target","questions","Target","questions","Target","questions","Target","questions","Target","questions","Target","questions","Target","questions","Target","questions","Target","questions","Target","questions","Target","questions","Target","questions","Target","questions","Target","questions","Target","questions","Target","questions","Target","questions","Target","questions","Target","questions","Target","questions","Target","questions","Target","questions","Target","questions","Target","questions","Target","questions","Target","questions","Target","questions","Target","questions","Target","questions","Target","questions","Target"]
["Question 1","Was equipment checked?",null,"Was a Room number documented?",null,null,null,null,null,null,null,null,null,null,null,null,null,null,null,null,null,null,null,null,null,null,null,null,null,null,null,null,null,null,null,null,null,null,null,null,null,null,null,null,null,null,null,null,null,null,null,null,null,null,null,null,null,null,null,null,null,null,null,null,null,null,null,null,null,null,null,null,null,null,null,null,null,null,null,null,null,null,null,null,null,null,null,null,null,null,null,null,null,null,null,null,null,null,null,"Test1"]
["Question 2","Was consent taken?",null,"Were stage A checks completed as appropriate?",null,null,null,null,null,null,null,null,null,null,null,null,null,null,null,null,null,null,null,null,null,null,null,null,null,null,null,null,null,null,null,null,null,null,null,null,null,null,null,null,null,null,null,null,null,null,null,null,null,null,null,null,null,null,null,null,null,null,null,null,null,null,null,null,null,null,null,null,null,null,null,null,null,null,null,null,null,null,null,null,null,null,null,null,null,null,null,null,null,null,null,null,null,null,null,"Test2"]
["Question 3","Was room number documented?",null,"Was COSI Part 1 performed?",null,null,null,null,null,null,null,null,null,null,null,null,null,null,null,null,null,null,null,null,null,null,null,null,null,null,null,null,null,null,null,null,null,null,null,null,null,null,null,null,null,null,null,null,null,null,null,null,null,null,null,null,null,null,null,null,null,null,null,null,null,null,null,null,null,null,null,null,null,null,null,null,null,null,null,null,null,null,null,null,null,null,null,null,null,null,null,null,null,null,null,null,null,null,null,"Test3"]
["Question 4","Was a report created?",null,"Was PVP documented?",null,null,null,null,null,null,null,null,null,null,null,null,null,null,null,null,null,null,null,null,null,null,null,null,null,null,null,null,null,null,null,null,null,null,null,null,null,null,null,null,null,null,null,null,null,null,null,null,null,null,null,null,null,null,null,null,null,null,null,null,null,null,null,null,null,null,null,null,null,null,null,null,null,null,null,null,null,null,null,null,null,null,null,null,null,null,null,null,null,null,null,null,null,null,null,"Test4"]
["Question 5",null,null,"Was Otoscopy documented?",null,null,null,null,null,null,null,null,null,null,null,null,null,null,null,null,null,null,null,null,null,null,null,null,null,null,null,null,null,null,null,null,null,null,null,null,null,null,null,null,null,null,null,null,null,null,null,null,null,null,null,null,null,null,null,null,null,null,null,null,null,null,null,null,null,null,null,null,null,null,null,null,null,null,null,null,null,null,null,null,null,null,null,null,null,null,null,null,null,null,null,null,null,null,null,"Test5"]
["Question 6",null,null,"Document bc at 3 & 4kHz is for programming purposes?",null,null,null,null,null,null,null,null,null,null,null,null,null,null,null,null,null,null,null,null,null,null,null,null,null,null,null,null,null,null,null,null,null,null,null,null,null,null,null,null,null,null,null,null,null,null,null,null,null,null,null,null,null,null,null,null,null,null,null,null,null,null,null,null,null,null,null,null,null,null,null,null,null,null,null,null,null,null,null,null,null,null,null,null,null,null,null,null,null,null,null,null,null,null,null,"Test6"]
["Question 7",null,null,"Was Speech testing performed?",null,null,null,null,null,null,null,null,null,null,null,null,null,null,null,null,null,null,null,null,null,null,null,null,null,null,null,null,null,null,null,null,null,null,null,null,null,null,null,null,null,null,null,null,null,null,null,null,null,null,null,null,null,null,null,null,null,null,null,null,null,null,null,null,null,null,null,null,null,null,null,null,null,null,null,null,null,null,null,null,null,null,null,null,null,null,null,null,null,null,null,null,null,null,null,"Test7"]
["Question 8",null,null,"Is it documented whether national criteria were/were not met?",null,null,null,null,null,null,null,null,null,null,null,null,null,null,null,null,null,null,null,null,null,null,null,null,null,null,null,null,null,null,null,null,null,null,null,null,null,null,null,null,null,null,null,null,null,null,null,null,null,null,null,null,null,null,null,null,null,null,null,null,null,null,null,null,null,null,null,null,null,null,null,null,null,null,null,null,null,null,null,null,null,null,null,null,null,null,null,null,null,null,null,null,null,null,null,"Test8"]
["Question 9",null,null,"Was a BCHI info pack supplied?",null,null,null,null,null,null,null,null,null,null,null,null,null,null,null,null,null,null,null,null,null,null,null,null,null,null,null,null,null,null,null,null,null,null,null,null,null,null,null,null,null,null,null,null,null,null,null,null,null,null,null,null,null,null,null,null,null,null,null,null,null,null,null,null,null,null,null,null,null,null,null,null,null,null,null,null,null,null,null,null,null,null,null,null,null,null,null,null,null,null,null,null,null,null,null,"Test9"]
["Question 10",null,null,"Was the report authorised & issued within target (7 days)?",null,null,null,null,null,null,null,null,null,null,null,null,null,null,null,null,null,null,null,null,null,null,null,null,null,null,null,null,null,null,null,null,null,null,null,null,null,null,null,null,null,null,null,null,null,null,null,null,null,null,null,null,null,null,null,null,null,null,null,null,null,null,null,null,null,null,null,null,null,null,null,null,null,null,null,null,null,null,null,null,null,null,null,null,null,null,null,null,null,null,null,null,null,null,null,"Test10"]
["Question 11",null,null,"Was consent documented as appropriate?",null,null,null,null,null,null,null,null,null,null,null,null,null,null,null,null,null,null,null,null,null,null,null,null,null,null,null,null,null,null,null,null,null,null,null,null,null,null,null,null,null,null,null,null,null,null,null,null,null,null,null,null,null,null,null,null,null,null,null,null,null,null,null,null,null,null,null,null,null,null,null,null,null,null,null,null,null,null,null,null,null,null,null,null,null,null,null,null,null,null,null,null,null,null,null,"Test11"]
["Question 12",null,null,null,null,null,null,null,null,null,null,null,null,null,null,null,null,null,null,null,null,null,null,null,null,null,null,null,null,null,null,null,null,null,null,null,null,null,null,null,null,null,null,null,null,null,null,null,null,null,null,null,null,null,null,null,null,null,null,null,null,null,null,null,null,null,null,null,null,null,null,null,null,null,null,null,null,null,null,null,null,null,null,null,null,null,null,null,null,null,null,null,null,null,null,null,null,null,null,"Test12"]
["Question 13",null,null,null,null,null,null,null,null,null,null,null,null,null,null,null,null,null,null,null,null,null,null,null,null,null,null,null,null,null,null,null,null,null,null,null,null,null,null,null,null,null,null,null,null,null,null,null,null,null,null,null,null,null,null,null,null,null,null,null,null,null,null,null,null,null,null,null,null,null,null,null,null,null,null,null,null,null,null,null,null,null,null,null,null,null,null,null,null,null,null,null,null,null,null,null,null,null,null,"Test13"]
["Question 14",null,null,null,null,null,null,null,null,null,null,null,null,null,null,null,null,null,null,null,null,null,null,null,null,null,null,null,null,null,null,null,null,null,null,null,null,null,null,null,null,null,null,null,null,null,null,null,null,null,null,null,null,null,null,null,null,null,null,null,null,null,null,null,null,null,null,null,null,null,null,null,null,null,null,null,null,null,null,null,null,null,null,null,null,null,null,null,null,null,null,null,null,null,null,null,null,null,null,"Test14"]
["Question 15",null,null,null,null,null,null,null,null,null,null,null,null,null,null,null,null,null,null,null,null,null,null,null,null,null,null,null,null,null,null,null,null,null,null,null,null,null,null,null,null,null,null,null,null,null,null,null,null,null,null,null,null,null,null,null,null,null,null,null,null,null,null,null,null,null,null,null,null,null,null,null,null,null,null,null,null,null,null,null,null,null,null,null,null,null,null,null,null,null,null,null,null,null,null,null,null,null,null,"Test15"]
["Question 16",null,null,null,null,null,null,null,null,null,null,null,null,null,null,null,null,null,null,null,null,null,null,null,null,null,null,null,null,null,null,null,null,null,null,null,null,null,null,null,null,null,null,null,null,null,null,null,null,null,null,null,null,null,null,null,null,null,null,null,null,null,null,null,null,null,null,null,null,null,null,null,null,null,null,null,null,null,null,null,null,null,null,null,null,null,null,null,null,null,null,null,null,null,null,null,null,null,null,"Test16"]
["Question 17",null,null,null,null,null,null,null,null,null,null,null,null,null,null,null,null,null,null,null,null,null,null,null,null,null,null,null,null,null,null,null,null,null,null,null,null,null,null,null,null,null,null,null,null,null,null,null,null,null,null,null,null,null,null,null,null,null,null,null,null,null,null,null,null,null,null,null,null,null,null,null,null,null,null,null,null,null,null,null,null,null,null,null,null,null,null,null,null,null,null,null,null,null,null,null,null,null,null,"Test17"]
["Question 18",null,null,null,null,null,null,null,null,null,null,null,null,null,null,null,null,null,null,null,null,null,null,null,null,null,null,null,null,null,null,null,null,null,null,null,null,null,null,null,null,null,null,null,null,null,null,null,null,null,null,null,null,null,null,null,null,null,null,null,null,null,null,null,null,null,null,null,null,null,null,null,null,null,null,null,null,null,null,null,null,null,null,null,null,null,null,null,null,null,null,null,null,null,null,null,null,null,null,"Test18"]
["Question 19",null,null,null,null,null,null,null,null,null,null,null,null,null,null,null,null,null,null,null,null,null,null,null,null,null,null,null,null,null,null,null,null,null,null,null,null,null,null,null,null,null,null,null,null,null,null,null,null,null,null,null,null,null,null,null,null,null,null,null,null,null,null,null,null,null,null,null,null,null,null,null,null,null,null,null,null,null,null,null,null,null,null,null,null,null,null,null,null,null,null,null,null,null,null,null,null,null,null,"Test19"]
["Question 20",null,null,null,null,null,null,null,null,null,null,null,null,null,null,null,null,null,null,null,null,null,null,null,null,null,null,null,null,null,null,null,null,null,null,null,null,null,null,null,null,null,null,null,null,null,null,null,null,null,null,null,null,null,null,null,null,null,null,null,null,null,null,null,null,null,null,null,null,null,null,null,null,null,null,null,null,null,null,null,null,null,null,null,null,null,null,null,null,null,null,null,null,null,null,null,null,null,null,"Test20"]
["Question 21",null,null,null,null,null,null,null,null,null,null,null,null,null,null,null,null,null,null,null,null,null,null,null,null,null,null,null,null,null,null,null,null,null,null,null,null,null,null,null,null,null,null,null,null,null,null,null,null,null,null,null,null,null,null,null,null,null,null,null,null,null,null,null,null,null,null,null,null,null,null,null,null,null,null,null,null,null,null,null,null,null,null,null,null,null,null,null,null,null,null,null,null,null,null,null,null,null,null,"Test21"]
["Question 22",null,null,null,null,null,null,null,null,null,null,null,null,null,null,null,null,null,null,null,null,null,null,null,null,null,null,null,null,null,null,null,null,null,null,null,null,null,null,null,null,null,null,null,null,null,null,null,null,null,null,null,null,null,null,null,null,null,null,null,null,null,null,null,null,null,null,null,null,null,null,null,null,null,null,null,null,null,null,null,null,null,null,null,null,null,null,null,null,null,null,null,null,null,null,null,null,null,null,"Test22"]
["Question 23",null,null,null,null,null,null,null,null,null,null,null,null,null,null,null,null,null,null,null,null,null,null,null,null,null,null,null,null,null,null,null,null,null,null,null,null,null,null,null,null,null,null,null,null,null,null,null,null,null,null,null,null,null,null,null,null,null,null,null,null,null,null,null,null,null,null,null,null,null,null,null,null,null,null,null,null,null,null,null,null,null,null,null,null,null,null,null,null,null,null,null,null,null,null,null,null,null,null,"Test23"]
["Question 24",null,null,null,null,null,null,null,null,null,null,null,null,null,null,null,null,null,null,null,null,null,null,null,null,null,null,null,null,null,null,null,null,null,null,null,null,null,null,null,null,null,null,null,null,null,null,null,null,null,null,null,null,null,null,null,null,null,null,null,null,null,null,null,null,null,null,null,null,null,null,null,null,null,null,null,null,null,null,null,null,null,null,null,null,null,null,null,null,null,null,null,null,null,null,null,null,null,null,"Test24"]
["Question 25",null,null,null,null,null,null,null,null,null,null,null,null,null,null,null,null,null,null,null,null,null,null,null,null,null,null,null,null,null,null,null,null,null,null,null,null,null,null,null,null,null,null,null,null,null,null,null,null,null,null,null,null,null,null,null,null,null,null,null,null,null,null,null,null,null,null,null,null,null,null,null,null,null,null,null,null,null,null,null,null,null,null,null,null,null,null,null,null,null,null,null,null,null,null,null,null,null,null,"Test25"]
["Question 26",null,null,null,null,null,null,null,null,null,null,null,null,null,null,null,null,null,null,null,null,null,null,null,null,null,null,null,null,null,null,null,null,null,null,null,null,null,null,null,null,null,null,null,null,null,null,null,null,null,null,null,null,null,null,null,null,null,null,null,null,null,null,null,null,null,null,null,null,null,null,null,null,null,null,null,null,null,null,null,null,null,null,null,null,null,null,null,null,null,null,null,null,null,null,null,null,null,null,"Test26"]
["Question 27",null,null,null,null,null,null,null,null,null,null,null,null,null,null,null,null,null,null,null,null,null,null,null,null,null,null,null,null,null,null,null,null,null," ",null,null,null,null,null,null,null,null,null,null,null,null,null,null,null,null,null,null,null,null,null,null,null,null,null,null,null,null,null,null,null,null,null,null,null,null,null,null,null,null,null,null,null,null,null,null,null,null,null,null,null,null,null,null,null,null,null,null,null,null,null,null,null,null,"Test27"]
["Question 28",null,null,null,null,null,null,null,null,null,null,null,null,null,null,null,null,null,null,null,null,null,null,null,null,null,null,null,null,null,null,null,null,null," ",null,null,null,null,null,null,null,null,null,null,null,null,null,null,null,null,null,null,null,null,null,null,null,null,null,null,null,null,null,null,null,null,null,null,null,null,null,null,null,null,null,null,null,null,null,null,null,null,null,null,null,null,null,null,null,null,null,null,null,null,null,null,null,null,"Test28"]
["Question 29",null,null,null,null,null,null,null,null,null,null,null,null,null,null,null,null,null,null,null,null,null,null,null,null,null,null,null,null,null,null,null,null,null," ",null,null,null,null,null,null,null,null,null,null,null,null,null,null,null,null,null,null,null,null,null,null,null,null,null,null,null,null,null,null,null,null,null,null,null,null,null,null,null,null,null,null,null,null,null,null,null,null,null,null,null,null,null,null,null,null,null,null,null,null,null,null,null,null,"Test29"]
["Question 30",null,null,null,null,null,null,null,null,null,null,null,null,null,null,null,null,null,null,null,null,null,null,null,null,null,null,null,null,null,null,null,null,null," ",null,null,null,null,null,null,null,null,null,null,null,null,null,null,null,null,null,null,null,null,null,null,null,null,null,null,null,null,null,null,null,null,null,null,null,null,null,null,null,null,null,null,null,null,null,null,null,null,null,null,null,null,null,null,null,null,null,null,null,null,null,null,null,null,"Test30"]
["Question 31",null,null,null,null,null,null,null,null,null,null,null,null,null,null,null,null,null,null,null,null,null,null,null,null,null,null,null,null,null,null,null,null,null," ",null,null,null,null,null,null,null,null,null,null,null,null,null,null,null,null,null,null,null,null,null,null,null,null,null,null,null,null,null,null,null,null,null,null,null,null,null,null,null,null,null,null,null,null,null,null,null,null,null,null,null,null,null,null,null,null,null,null,null,null,null,null,null,null,"Test31"]
["Question 32",null,null,null,null,null,null,null,null,null,null,null,null,null,null,null,null,null,null,null,null,null,null,null,null,null,null,null,null,null,null,null,null,null," ",null,null,null,null,null,null,null,null,null,null,null,null,null,null,null,null,null,null,null,null,null,null,null,null,null,null,null,null,null,null,null,null,null,null,null,null,null,null,null,null,null,null,null,null,null,null,null,null,null,null,null,null,null,null,null,null,null,null,null,null,null,null,null,null,"Test32"]
["Question 33",null,null,null,null,null,null,null,null,null,null,null,null,null,null,null,null,null,null,null,null,null,null,null,null,null,null,null,null,null,null,null,null,null," ",null,null,null,null,null,null,null,null,null,null,null,null,null,null,null,null,null,null,null,null,null,null,null,null,null,null,null,null,null,null,null,null,null,null,null,null,null,null,null,null,null,null,null,null,null,null,null,null,null,null,null,null,null,null,null,null,null,null,null,null,null,null,null,null,"Test33"]
["Question 34",null,null,null,null,null,null,null,null,null,null,null,null,null,null,null,null,null,null,null,null,null,null,null,null,null,null,null,null,null,null,null,null,null," ",null,null,null,null,null,null,null,null,null,null,null,null,null,null,null,null,null,null,null,null,null,null,null,null,null,null,null,null,null,null,null,null,null,null,null,null,null,null,null,null,null,null,null,null,null,null,null,null,null,null,null,null,null,null,null,null,null,null,null,null,null,null,null,null,"Test34"]
["Question 35",null,null,null,null,null,null,null,null,null,null,null,null,null,null,null,null,null,null,null,null,null,null,null,null,null,null,null,null,null,null,null,null,null," ",null,null,null,null,null,null,null,null,null,null,null,null,null,null,null,null,null,null,null,null,null,null,null,null,null,null,null,null,null,null,null,null,null,null,null,null,null,null,null,null,null,null,null,null,null,null,null,null,null,null,null,null,null,null,null,null,null,null,null,null,null,null,null,null,"Test35"]
["Question 36",null,null,null,null,null,null,null,null,null,null,null,null,null,null,null,null,null,null,null,null,null,null,null,null,null,null,null,null,null,null,null,null,null," ",null,null,null,null,null,null,null,null,null,null,null,null,null,null,null,null,null,null,null,null,null,null,null,null,null,null,null,null,null,null,null,null,null,null,null,null,null,null,null,null,null,null,null,null,null,null,null,null,null,null,null,null,null,null,null,null,null,null,null,null,null,null,null,null,"Test36"]
["Question 37",null,null,null,null,null,null,null,null,null,null,null,null,null,null,null,null,null,null,null,null,null,null,null,null,null,null,null,null,null,null,null,null,null," ",null,null,null,null,null,null,null,null,null,null,null,null,null,null,null,null,null,null,null,null,null,null,null,null,null,null,null,null,null,null,null,null,null,null,null,null,null,null,null,null,null,null,null,null,null,null,null,null,null,null,null,null,null,null,null,null,null,null,null,null,null,null,null,null,"Test37"]
["Question 38",null,null,null,null,null,null,null,null,null,null,null,null,null,null,null,null,null,null,null,null,null,null,null,null,null,null,null,null,null,null,null,null,null," ",null,null,null,null,null,null,null,null,null,null,null,null,null,null,null,null,null,null,null,null,null,null,null,null,null,null,null,null,null,null,null,null,null,null,null,null,null,null,null,null,null,null,null,null,null,null,null,null,null,null,null,null,null,null,null,null,null,null,null,null,null,null,null,null,"Test38"]
["Question 39",null,null,null,null,null,null,null,null,null,null,null,null,null,null,null,null,null,null,null,null,null,null,null,null,null,null,null,null,null,null,null,null,null," ",null,null,null,null,null,null,null,null,null,null,null,null,null,null,null,null,null,null,null,null,null,null,null,null,null,null,null,null,null,null,null,null,null,null,null,null,null,null,null,null,null,null,null,null,null,null,null,null,null,null,null,null,null,null,null,null,null,null,null,null,null,null,null,null,"Test39"]
["Question 40",null,null,null,null,null,null,null,null,null,null,null,null,null,null,null,null,null,null,null,null,null,null,null,null,null,null,null,null,null,null,null,null,null," ",null,null,null,null,null,null,null,null,null,null,null,null,null,null,null,null,null,null,null,null,null,null,null,null,null,null,null,null,null,null,null,null,null,null,null,null,null,null,null,null,null,null,null,null,null,null,null,null,null,null,null,null,null,null,null,null,null,null,null,null,null,null,null,null,"Test40"]

{"sheet":"Year","index":3,"n_rows":186,"n_cols":16,"rows_kept":186,"cut":false,"hidden":false,"merged":[[0,1,0,4],[1,1,1,4]]}
["Quality Monitoring Audit",{"$f":"Start!B1","v":"BCHI - Assessments"}]
["Year"]
[]
["Total number of audits ",{"$f":"IF(ISERROR(COUNTIF(April!B5,\">0\")+COUNTIF(May!B5,\">0\")+COUNTIF(June!B5,\">0\")+COUNTIF(July!B5,\">0\")+COUNTIF(Aug!B5,\">0\")+COUNTIF(Sept!B5,\">0\")++COUNTIF(Oct!B5,\">0\")+COUNTIF(Nov!B5,\">0\")+COUNTIF(Dec!B5,\">0\")+COUNTIF(Jan!B5,\">0\")+COUNTIF(Feb!B5,\">0\")+COUNTIF(March!B5,\">0\")),\"0\",COUNTIF(April!B5,\">0\")+COUNTIF(May!B5,\">0\")+COUNTIF(June!B5,\">0\")+COUNTIF(July!B5,\">0\")+COUNTIF(Aug!B5,\">0\")+COUNTIF(Sept!B5,\">0\")++COUNTIF(Oct!B5,\">0\")+COUNTIF(Nov!B5,\">0\")+COUNTIF(Dec!B5,\">0\")+COUNTIF(Jan!B5,\">0\")+COUNTIF(Feb!B5,\">0\")+COUNTIF(March!B5,\">0\"))","v":12},null,null,null,null,"If no specific targets are set, results will default to traffic lights (if set)"]
["Average compliance for year",{"$f":"IF(ISERROR(N98),\"\",N98)","v":0.93295454545454559},null,null,null,null,"above",0.95]
["Average compliance with justified for year",{"$f":"IF(ISERROR(N54),\"\",N54)","v":0.96843434343434343},null,null,null,null,"between","80-95%"]
["Highest compliance value",{"$f":"MAX(B98:M98)","v":0.97727272727272729},null,null,null,null,"below",0.8]
["Lowest compliance value",{"$f":"IF(ISERROR(SMALL(B98:M98,COUNTIF(B98:M98,0)+1)),\"\",SMALL(B98:M98,COUNTIF(B98:M98,0)+1))","v":0.86363636363636365}]
["Highest compliance value with justified",{"$f":"MAX(B54:M54)","v":1}]
["Lowest compliance value with justified",{"$f":"IF(ISERROR(SMALL(B54:M54,COUNTIF(B54:M54,0)+1)),\"\",SMALL(B54:M54,COUNTIF(B54:M54,0)+1))","v":0.93181818181818177}]
[]
["Overall result (compliant + Justified)","(click through to month)"]
["Metric","April","May","June","July","August","September","October","November","December","January","February","March","Year average","Target","Math"]
[{"$f":"IF(ISERROR(Q!A2),\"\",Q!A2)","v":"Was a Room number documented?"},{"$f":"IFERROR(INDEX(April!C:C,MATCH(Year!A:A,April!A:A,0)),\"\")","v":1},{"$f":"IFERROR(INDEX(May!C:C,MATCH(Year!A:A,May!A:A,0)),\"\")","v":1},{"$f":"IFERROR(INDEX(June!C:C,MATCH(Year!A:A,June!A:A,0)),\"\")","v":1},{"$f":"IFERROR(INDEX(July!C:C,MATCH(Year!A:A,July!A:A,0)),\"\")","v":1},{"$f":"IFERROR(INDEX(Aug!C:C,MATCH(Year!A:A,Aug!A:A,0)),\"\")","v":1},{"$f":"IFERROR(INDEX(Sept!C:C,MATCH(Year!A:A,Sept!A:A,0)),\"\")","v":1},{"$f":"IFERROR(INDEX(Oct!C:C,MATCH(Year!A:A,Oct!A:A,0)),\"\")","v":1},{"$f":"IFERROR(INDEX(Nov!C:C,MATCH(Year!A:A,Nov!A:A,0)),\"\")","v":1},{"$f":"IFERROR(INDEX(Dec!C:C,MATCH(Year!A:A,Dec!A:A,0)),\"\")","v":1},{"$f":"IFERROR(INDEX(Jan!C:C,MATCH(Year!A:A,Jan!A:A,0)),\"\")","v":1},{"$f":"IFERROR(INDEX(Feb!C:C,MATCH(Year!A:A,Feb!A:A,0)),\"\")","v":0.8},{"$f":"IFERROR(INDEX(March!C:C,MATCH(Year!A:A,March!A:A,0)),\"\")","v":1},{"$f":"IF(ISERROR((SUM(B14:M14))/P14),\"\",(SUM(B14:M14))/P14)","v":0.98333333333333339},{"$f":"IF(ISERROR(Q!B2),\"\",Q!B2)","v":0},{"$f":"COUNTIF(B14:M14,\">-1\")","v":12}]
[{"$f":"IF(ISERROR(Q!A3),\"\",Q!A3)","v":"Were stage A checks completed as appropriate?"},{"$f":"IFERROR(INDEX(April!C:C,MATCH(Year!A:A,April!A:A,0)),\"\")","v":1},{"$f":"IFERROR(INDEX(May!C:C,MATCH(Year!A:A,May!A:A,0)),\"\")","v":0.75},{"$f":"IFERROR(INDEX(June!C:C,MATCH(Year!A:A,June!A:A,0)),\"\")","v":1},{"$f":"IFERROR(INDEX(July!C:C,MATCH(Year!A:A,July!A:A,0)),\"\")","v":1},{"$f":"IFERROR(INDEX(Aug!C:C,MATCH(Year!A:A,Aug!A:A,0)),\"\")","v":0.8},{"$f":"IFERROR(INDEX(Sept!C:C,MATCH(Year!A:A,Sept!A:A,0)),\"\")","v":1},{"$f":"IFERROR(INDEX(Oct!C:C,MATCH(Year!A:A,Oct!A:A,0)),\"\")","v":1},{"$f":"IFERROR(INDEX(Nov!C:C,MATCH(Year!A:A,Nov!A:A,0)),\"\")","v":1},{"$f":"IFERROR(INDEX(Dec!C:C,MATCH(Year!A:A,Dec!A:A,0)),\"\")","v":1},{"$f":"IFERROR(INDEX(Jan!C:C,MATCH(Year!A:A,Jan!A:A,0)),\"\")","v":0.83333333333333337},{"$f":"IFERROR(INDEX(Feb!C:C,MATCH(Year!A:A,Feb!A:A,0)),\"\")","v":0.75},{"$f":"IFERROR(INDEX(March!C:C,MATCH(Year!A:A,March!A:A,0)),\"\")","v":1},{"$f":"IF(ISERROR((SUM(B15:M15))/P15),\"\",(SUM(B15:M15))/P15)","v":0.92777777777777792},{"$f":"IF(ISERROR(Q!B3),\"\",Q!B3)","v":0},{"$f":"COUNTIF(B15:M15,\">-1\")","v":12}]
[{"$f":"IF(ISERROR(Q!A4),\"\",Q!A4)","v":"Was COSI Part 1 performed?"},{"$f":"IFERROR(INDEX(April!C:C,MATCH(Year!A:A,April!A:A,0)),\"\")","v":0.6},{"$f":"IFERROR(INDEX(May!C:C,MATCH(Year!A:A,May!A:A,0)),\"\")","v":0.5},{"$f":"IFERROR(INDEX(June!C:C,MATCH(Year!A:A,June!A:A,0)),\"\")","v":0.8},{"$f":"IFERROR(INDEX(July!C:C,MATCH(Year!A:A,July!A:A,0)),\"\")","v":0.8},{"$f":"IFERROR(INDEX(Aug!C:C,MATCH(Year!A:A,Aug!A:A,0)),\"\")","v":1},{"$f":"IFERROR(INDEX(Sept!C:C,MATCH(Year!A:A,Sept!A:A,0)),\"\")","v":0.75},{"$f":"IFERROR(INDEX(Oct!C:C,MATCH(Year!A:A,Oct!A:A,0)),\"\")","v":1},{"$f":"IFERROR(INDEX(Nov!C:C,MATCH(Year!A:A,Nov!A:A,0)),\"\")","v":1},{"$f":"IFERROR(INDEX(Dec!C:C,MATCH(Year!A:A,Dec!A:A,0)),\"\")","v":0.6},{"$f":"IFERROR(INDEX(Jan!C:C,MATCH(Year!A:A,Jan!A:A,0)),\"\")","v":0.83333333333333337},{"$f":"IFERROR(INDEX(Feb!C:C,MATCH(Year!A:A,Feb!A:A,0)),\"\")","v":1},{"$f":"IFERROR(INDEX(March!C:C,MATCH(Year!A:A,March!A:A,0)),\"\")","v":0.66666666666666663},0.79583333333333328,{"$f":"IF(ISERROR(Q!B4),\"\",Q!B4)","v":0},12]
[{"$f":"IF(ISERROR(Q!A5),\"\",Q!A5)","v":"Was PVP documented?"},{"$f":"IFERROR(INDEX(April!C:C,MATCH(Year!A:A,April!A:A,0)),\"\")","v":1},{"$f":"IFERROR(INDEX(May!C:C,MATCH(Year!A:A,May!A:A,0)),\"\")","v":1},{"$f":"IFERROR(INDEX(June!C:C,MATCH(Year!A:A,June!A:A,0)),\"\")","v":1},{"$f":"IFERROR(INDEX(July!C:C,MATCH(Year!A:A,July!A:A,0)),\"\")","v":1},{"$f":"IFERROR(INDEX(Aug!C:C,MATCH(Year!A:A,Aug!A:A,0)),\"\")","v":1},{"$f":"IFERROR(INDEX(Sept!C:C,MATCH(Year!A:A,Sept!A:A,0)),\"\")","v":1},{"$f":"IFERROR(INDEX(Oct!C:C,MATCH(Year!A:A,Oct!A:A,0)),\"\")","v":1},{"$f":"IFERROR(INDEX(Nov!C:C,MATCH(Year!A:A,Nov!A:A,0)),\"\")","v":1},{"$f":"IFERROR(INDEX(Dec!C:C,MATCH(Year!A:A,Dec!A:A,0)),\"\")","v":1},{"$f":"IFERROR(INDEX(Jan!C:C,MATCH(Year!A:A,Jan!A:A,0)),\"\")","v":1},{"$f":"IFERROR(INDEX(Feb!C:C,MATCH(Year!A:A,Feb!A:A,0)),\"\")","v":1},{"$f":"IFERROR(INDEX(March!C:C,MATCH(Year!A:A,March!A:A,0)),\"\")","v":1},1,{"$f":"IF(ISERROR(Q!B5),\"\",Q!B5)","v":0},12]
[{"$f":"IF(ISERROR(Q!A6),\"\",Q!A6)","v":"Was Otoscopy documented?"},{"$f":"IFERROR(INDEX(April!C:C,MATCH(Year!A:A,April!A:A,0)),\"\")","v":1},{"$f":"IFERROR(INDEX(May!C:C,MATCH(Year!A:A,May!A:A,0)),\"\")","v":1},{"$f":"IFERROR(INDEX(June!C:C,MATCH(Year!A:A,June!A:A,0)),\"\")","v":1},{"$f":"IFERROR(INDEX(July!C:C,MATCH(Year!A:A,July!A:A,0)),\"\")","v":1},{"$f":"IFERROR(INDEX(Aug!C:C,MATCH(Year!A:A,Aug!A:A,0)),\"\")","v":1},{"$f":"IFERROR(INDEX(Sept!C:C,MATCH(Year!A:A,Sept!A:A,0)),\"\")","v":1},{"$f":"IFERROR(INDEX(Oct!C:C,MATCH(Year!A:A,Oct!A:A,0)),\"\")","v":1},{"$f":"IFERROR(INDEX(Nov!C:C,MATCH(Year!A:A,Nov!A:A,0)),\"\")","v":0.75},{"$f":"IFERROR(INDEX(Dec!C:C,MATCH(Year!A:A,Dec!A:A,0)),\"\")","v":1},{"$f":"IFERROR(INDEX(Jan!C:C,MATCH(Year!A:A,Jan!A:A,0)),\"\")","v":1},{"$f":"IFERROR(INDEX(Feb!C:C,MATCH(Year!A:A,Feb!A:A,0)),\"\")","v":0.8},{"$f":"IFERROR(INDEX(March!C:C,MATCH(Year!A:A,March!A:A,0)),\"\")","v":1},0.96250000000000002,{"$f":"IF(ISERROR(Q!B6),\"\",Q!B6)","v":0},12]
[{"$f":"IF(ISERROR(Q!A7),\"\",Q!A7)","v":"Document bc at 3 & 4kHz is for programming purposes?"},{"$f":"IFERROR(INDEX(April!C:C,MATCH(Year!A:A,April!A:A,0)),\"\")","v":1},{"$f":"IFERROR(INDEX(May!C:C,MATCH(Year!A:A,May!A:A,0)),\"\")","v":1},{"$f":"IFERROR(INDEX(June!C:C,MATCH(Year!A:A,June!A:A,0)),\"\")","v":1},{"$f":"IFERROR(INDEX(July!C:C,MATCH(Year!A:A,July!A:A,0)),\"\")","v":1},{"$f":"IFERROR(INDEX(Aug!C:C,MATCH(Year!A:A,Aug!A:A,0)),\"\")","v":1},{"$f":"IFERROR(INDEX(Sept!C:C,MATCH(Year!A:A,Sept!A:A,0)),\"\")","v":1},{"$f":"IFERROR(INDEX(Oct!C:C,MATCH(Year!A:A,Oct!A:A,0)),\"\")","v":1},{"$f":"IFERROR(INDEX(Nov!C:C,MATCH(Year!A:A,Nov!A:A,0)),\"\")","v":1},{"$f":"IFERROR(INDEX(Dec!C:C,MATCH(Year!A:A,Dec!A:A,0)),\"\")","v":1},{"$f":"IFERROR(INDEX(Jan!C:C,MATCH(Year!A:A,Jan!A:A,0)),\"\")","v":1},{"$f":"IFERROR(INDEX(Feb!C:C,MATCH(Year!A:A,Feb!A:A,0)),\"\")","v":1},{"$f":"IFERROR(INDEX(March!C:C,MATCH(Year!A:A,March!A:A,0)),\"\")","v":1},1,{"$f":"IF(ISERROR(Q!B7),\"\",Q!B7)","v":0},12]
[{"$f":"IF(ISERROR(Q!A8),\"\",Q!A8)","v":"Was Speech testing performed?"},{"$f":"IFERROR(INDEX(April!C:C,MATCH(Year!A:A,April!A:A,0)),\"\")","v":1},{"$f":"IFERROR(INDEX(May!C:C,MATCH(Year!A:A,May!A:A,0)),\"\")","v":1},{"$f":"IFERROR(INDEX(June!C:C,MATCH(Year!A:A,June!A:A,0)),\"\")","v":1},{"$f":"IFERROR(INDEX(July!C:C,MATCH(Year!A:A,July!A:A,0)),\"\")","v":1},{"$f":"IFERROR(INDEX(Aug!C:C,MATCH(Year!A:A,Aug!A:A,0)),\"\")","v":1},{"$f":"IFERROR(INDEX(Sept!C:C,MATCH(Year!A:A,Sept!A:A,0)),\"\")","v":1},{"$f":"IFERROR(INDEX(Oct!C:C,MATCH(Year!A:A,Oct!A:A,0)),\"\")","v":1},{"$f":"IFERROR(INDEX(Nov!C:C,MATCH(Year!A:A,Nov!A:A,0)),\"\")","v":1},{"$f":"IFERROR(INDEX(Dec!C:C,MATCH(Year!A:A,Dec!A:A,0)),\"\")","v":1},{"$f":"IFERROR(INDEX(Jan!C:C,MATCH(Year!A:A,Jan!A:A,0)),\"\")","v":1},{"$f":"IFERROR(INDEX(Feb!C:C,MATCH(Year!A:A,Feb!A:A,0)),\"\")","v":1},{"$f":"IFERROR(INDEX(March!C:C,MATCH(Year!A:A,March!A:A,0)),\"\")","v":1},1,{"$f":"IF(ISERROR(Q!B8),\"\",Q!B8)","v":0},12]
[{"$f":"IF(ISERROR(Q!A9),\"\",Q!A9)","v":"Is it documented whether national criteria were/were not met?"},{"$f":"IFERROR(INDEX(April!C:C,MATCH(Year!A:A,April!A:A,0)),\"\")","v":0.8},{"$f":"IFERROR(INDEX(May!C:C,MATCH(Year!A:A,May!A:A,0)),\"\")","v":1},{"$f":"IFERROR(INDEX(June!C:C,MATCH(Year!A:A,June!A:A,0)),\"\")","v":1},{"$f":"IFERROR(INDEX(July!C:C,MATCH(Year!A:A,July!A:A,0)),\"\")","v":1},{"$f":"IFERROR(INDEX(Aug!C:C,MATCH(Year!A:A,Aug!A:A,0)),\"\")","v":1},{"$f":"IFERROR(INDEX(Sept!C:C,MATCH(Year!A:A,Sept!A:A,0)),\"\")","v":1},{"$f":"IFERROR(INDEX(Oct!C:C,MATCH(Year!A:A,Oct!A:A,0)),\"\")","v":1},{"$f":"IFERROR(INDEX(Nov!C:C,MATCH(Year!A:A,Nov!A:A,0)),\"\")","v":1},{"$f":"IFERROR(INDEX(Dec!C:C,MATCH(Year!A:A,Dec!A:A,0)),\"\")","v":1},{"$f":"IFERROR(INDEX(Jan!C:C,MATCH(Year!A:A,Jan!A:A,0)),\"\")","v":1},{"$f":"IFERROR(INDEX(Feb!C:C,MATCH(Year!A:A,Feb!A:A,0)),\"\")","v":1},{"$f":"IFERROR(INDEX(March!C:C,MATCH(Year!A:A,March!A:A,0)),\"\")","v":1},0.98333333333333339,{"$f":"IF(ISERROR(Q!B9),\"\",Q!B9)","v":0},12]
[{"$f":"IF(ISERROR(Q!A10),\"\",Q!A10)","v":"Was a BCHI info pack supplied?"},{"$f":"IFERROR(INDEX(April!C:C,MATCH(Year!A:A,April!A:A,0)),\"\")","v":1},{"$f":"IFERROR(INDEX(May!C:C,MATCH(Year!A:A,May!A:A,0)),\"\")","v":1},{"$f":"IFERROR(INDEX(June!C:C,MATCH(Year!A:A,June!A:A,0)),\"\")","v":1},{"$f":"IFERROR(INDEX(July!C:C,MATCH(Year!A:A,July!A:A,0)),\"\")","v":1},{"$f":"IFERROR(INDEX(Aug!C:C,MATCH(Year!A:A,Aug!A:A,0)),\"\")","v":1},{"$f":"IFERROR(INDEX(Sept!C:C,MATCH(Year!A:A,Sept!A:A,0)),\"\")","v":1},{"$f":"IFERROR(INDEX(Oct!C:C,MATCH(Year!A:A,Oct!A:A,0)),\"\")","v":1},{"$f":"IFERROR(INDEX(Nov!C:C,MATCH(Year!A:A,Nov!A:A,0)),\"\")","v":1},{"$f":"IFERROR(INDEX(Dec!C:C,MATCH(Year!A:A,Dec!A:A,0)),\"\")","v":1},{"$f":"IFERROR(INDEX(Jan!C:C,MATCH(Year!A:A,Jan!A:A,0)),\"\")","v":1},{"$f":"IFERROR(INDEX(Feb!C:C,MATCH(Year!A:A,Feb!A:A,0)),\"\")","v":1},{"$f":"IFERROR(INDEX(March!C:C,MATCH(Year!A:A,March!A:A,0)),\"\")","v":1},1,{"$f":"IF(ISERROR(Q!B10),\"\",Q!B10)","v":0},12]
[{"$f":"IF(ISERROR(Q!A11),\"\",Q!A11)","v":"Was the report authorised & issued within target (7 days)?"},{"$f":"IFERROR(INDEX(April!C:C,MATCH(Year!A:A,April!A:A,0)),\"\")","v":1},{"$f":"IFERROR(INDEX(May!C:C,MATCH(Year!A:A,May!A:A,0)),\"\")","v":1},{"$f":"IFERROR(INDEX(June!C:C,MATCH(Year!A:A,June!A:A,0)),\"\")","v":1},{"$f":"IFERROR(INDEX(July!C:C,MATCH(Year!A:A,July!A:A,0)),\"\")","v":1},{"$f":"IFERROR(INDEX(Aug!C:C,MATCH(Year!A:A,Aug!A:A,0)),\"\")","v":1},{"$f":"IFERROR(INDEX(Sept!C:C,MATCH(Year!A:A,Sept!A:A,0)),\"\")","v":1},{"$f":"IFERROR(INDEX(Oct!C:C,MATCH(Year!A:A,Oct!A:A,0)),\"\")","v":1},{"$f":"IFERROR(INDEX(Nov!C:C,MATCH(Year!A:A,Nov!A:A,0)),\"\")","v":1},{"$f":"IFERROR(INDEX(Dec!C:C,MATCH(Year!A:A,Dec!A:A,0)),\"\")","v":1},{"$f":"IFERROR(INDEX(Jan!C:C,MATCH(Year!A:A,Jan!A:A,0)),\"\")","v":1},{"$f":"IFERROR(INDEX(Feb!C:C,MATCH(Year!A:A,Feb!A:A,0)),\"\")","v":1},{"$f":"IFERROR(INDEX(March!C:C,MATCH(Year!A:A,March!A:A,0)),\"\")","v":1},1,{"$f":"IF(ISERROR(Q!B11),\"\",Q!B11)","v":0},12]
[{"$f":"IF(ISERROR(Q!A12),\"\",Q!A12)","v":"Was consent documented as appropriate?"},{"$f":"IFERROR(INDEX(April!C:C,MATCH(Year!A:A,April!A:A,0)),\"\")","v":1},{"$f":"IFERROR(INDEX(May!C:C,MATCH(Year!A:A,May!A:A,0)),\"\")","v":1},{"$f":"IFERROR(INDEX(June!C:C,MATCH(Year!A:A,June!A:A,0)),\"\")","v":1},{"$f":"IFERROR(INDEX(July!C:C,MATCH(Year!A:A,July!A:A,0)),\"\")","v":1},{"$f":"IFERROR(INDEX(Aug!C:C,MATCH(Year!A:A,Aug!A:A,0)),\"\")","v":1},{"$f":"IFERROR(INDEX(Sept!C:C,MATCH(Year!A:A,Sept!A:A,0)),\"\")","v":1},{"$f":"IFERROR(INDEX(Oct!C:C,MATCH(Year!A:A,Oct!A:A,0)),\"\")","v":1},{"$f":"IFERROR(INDEX(Nov!C:C,MATCH(Year!A:A,Nov!A:A,0)),\"\")","v":1},{"$f":"IFERROR(INDEX(Dec!C:C,MATCH(Year!A:A,Dec!A:A,0)),\"\")","v":1},{"$f":"IFERROR(INDEX(Jan!C:C,MATCH(Year!A:A,Jan!A:A,0)),\"\")","v":1},{"$f":"IFERROR(INDEX(Feb!C:C,MATCH(Year!A:A,Feb!A:A,0)),\"\")","v":1},{"$f":"IFERROR(INDEX(March!C:C,MATCH(Year!A:A,March!A:A,0)),\"\")","v":1},1,{"$f":"IF(ISERROR(Q!B12),\"\",Q!B12)","v":0},12]
[{"$f":"IF(ISERROR(Q!A13),\"\",Q!A13)","v":0},{"$f":"IFERROR(INDEX(April!C:C,MATCH(Year!A:A,April!A:A,0)),\"\")","v":""},{"$f":"IFERROR(INDEX(May!C:C,MATCH(Year!A:A,May!A:A,0)),\"\")","v":""},{"$f":"IFERROR(INDEX(June!C:C,MATCH(Year!A:A,June!A:A,0)),\"\")","v":""},{"$f":"IFERROR(INDEX(July!C:C,MATCH(Year!A:A,July!A:A,0)),\"\")","v":""},{"$f":"IFERROR(INDEX(Aug!C:C,MATCH(Year!A:A,Aug!A:A,0)),\"\")","v":""},{"$f":"IFERROR(INDEX(Sept!C:C,MATCH(Year!A:A,Sept!A:A,0)),\"\")","v":""},{"$f":"IFERROR(INDEX(Oct!C:C,MATCH(Year!A:A,Oct!A:A,0)),\"\")","v":""},{"$f":"IFERROR(INDEX(Nov!C:C,MATCH(Year!A:A,Nov!A:A,0)),\"\")","v":""},{"$f":"IFERROR(INDEX(Dec!C:C,MATCH(Year!A:A,Dec!A:A,0)),\"\")","v":""},{"$f":"IFERROR(INDEX(Jan!C:C,MATCH(Year!A:A,Jan!A:A,0)),\"\")","v":""},{"$f":"IFERROR(INDEX(Feb!C:C,MATCH(Year!A:A,Feb!A:A,0)),\"\")","v":""},{"$f":"IFERROR(INDEX(March!C:C,MATCH(Year!A:A,March!A:A,0)),\"\")","v":""},"",{"$f":"IF(ISERROR(Q!B13),\"\",Q!B13)","v":0},0]
[{"$f":"IF(ISERROR(Q!A14),\"\",Q!A14)","v":0},{"$f":"IFERROR(INDEX(April!C:C,MATCH(Year!A:A,April!A:A,0)),\"\")","v":""},{"$f":"IFERROR(INDEX(May!C:C,MATCH(Year!A:A,May!A:A,0)),\"\")","v":""},{"$f":"IFERROR(INDEX(June!C:C,MATCH(Year!A:A,June!A:A,0)),\"\")","v":""},{"$f":"IFERROR(INDEX(July!C:C,MATCH(Year!A:A,July!A:A,0)),\"\")","v":""},{"$f":"IFERROR(INDEX(Aug!C:C,MATCH(Year!A:A,Aug!A:A,0)),\"\")","v":""},{"$f":"IFERROR(INDEX(Sept!C:C,MATCH(Year!A:A,Sept!A:A,0)),\"\")","v":""},{"$f":"IFERROR(INDEX(Oct!C:C,MATCH(Year!A:A,Oct!A:A,0)),\"\")","v":""},{"$f":"IFERROR(INDEX(Nov!C:C,MATCH(Year!A:A,Nov!A:A,0)),\"\")","v":""},{"$f":"IFERROR(INDEX(Dec!C:C,MATCH(Year!A:A,Dec!A:A,0)),\"\")","v":""},{"$f":"IFERROR(INDEX(Jan!C:C,MATCH(Year!A:A,Jan!A:A,0)),\"\")","v":""},{"$f":"IFERROR(INDEX(Feb!C:C,MATCH(Year!A:A,Feb!A:A,0)),\"\")","v":""},{"$f":"IFERROR(INDEX(March!C:C,MATCH(Year!A:A,March!A:A,0)),\"\")","v":""},"",{"$f":"IF(ISERROR(Q!B14),\"\",Q!B14)","v":0},0]
[{"$f":"IF(ISERROR(Q!A15),\"\",Q!A15)","v":0},{"$f":"IFERROR(INDEX(April!C:C,MATCH(Year!A:A,April!A:A,0)),\"\")","v":""},{"$f":"IFERROR(INDEX(May!C:C,MATCH(Year!A:A,May!A:A,0)),\"\")","v":""},{"$f":"IFERROR(INDEX(June!C:C,MATCH(Year!A:A,June!A:A,0)),\"\")","v":""},{"$f":"IFERROR(INDEX(July!C:C,MATCH(Year!A:A,July!A:A,0)),\"\")","v":""},{"$f":"IFERROR(INDEX(Aug!C:C,MATCH(Year!A:A,Aug!A:A,0)),\"\")","v":""},{"$f":"IFERROR(INDEX(Sept!C:C,MATCH(Year!A:A,Sept!A:A,0)),\"\")","v":""},{"$f":"IFERROR(INDEX(Oct!C:C,MATCH(Year!A:A,Oct!A:A,0)),\"\")","v":""},{"$f":"IFERROR(INDEX(Nov!C:C,MATCH(Year!A:A,Nov!A:A,0)),\"\")","v":""},{"$f":"IFERROR(INDEX(Dec!C:C,MATCH(Year!A:A,Dec!A:A,0)),\"\")","v":""},{"$f":"IFERROR(INDEX(Jan!C:C,MATCH(Year!A:A,Jan!A:A,0)),\"\")","v":""},{"$f":"IFERROR(INDEX(Feb!C:C,MATCH(Year!A:A,Feb!A:A,0)),\"\")","v":""},{"$f":"IFERROR(INDEX(March!C:C,MATCH(Year!A:A,March!A:A,0)),\"\")","v":""},"",{"$f":"IF(ISERROR(Q!B15),\"\",Q!B15)","v":0},0]
[{"$f":"IF(ISERROR(Q!A16),\"\",Q!A16)","v":0},{"$f":"IFERROR(INDEX(April!C:C,MATCH(Year!A:A,April!A:A,0)),\"\")","v":""},{"$f":"IFERROR(INDEX(May!C:C,MATCH(Year!A:A,May!A:A,0)),\"\")","v":""},{"$f":"IFERROR(INDEX(June!C:C,MATCH(Year!A:A,June!A:A,0)),\"\")","v":""},{"$f":"IFERROR(INDEX(July!C:C,MATCH(Year!A:A,July!A:A,0)),\"\")","v":""},{"$f":"IFERROR(INDEX(Aug!C:C,MATCH(Year!A:A,Aug!A:A,0)),\"\")","v":""},{"$f":"IFERROR(INDEX(Sept!C:C,MATCH(Year!A:A,Sept!A:A,0)),\"\")","v":""},{"$f":"IFERROR(INDEX(Oct!C:C,MATCH(Year!A:A,Oct!A:A,0)),\"\")","v":""},{"$f":"IFERROR(INDEX(Nov!C:C,MATCH(Year!A:A,Nov!A:A,0)),\"\")","v":""},{"$f":"IFERROR(INDEX(Dec!C:C,MATCH(Year!A:A,Dec!A:A,0)),\"\")","v":""},{"$f":"IFERROR(INDEX(Jan!C:C,MATCH(Year!A:A,Jan!A:A,0)),\"\")","v":""},{"$f":"IFERROR(INDEX(Feb!C:C,MATCH(Year!A:A,Feb!A:A,0)),\"\")","v":""},{"$f":"IFERROR(INDEX(March!C:C,MATCH(Year!A:A,March!A:A,0)),\"\")","v":""},"",{"$f":"IF(ISERROR(Q!B16),\"\",Q!B16)","v":0},0]
[{"$f":"IF(ISERROR(Q!A17),\"\",Q!A17)","v":0},{"$f":"IFERROR(INDEX(April!C:C,MATCH(Year!A:A,April!A:A,0)),\"\")","v":""},{"$f":"IFERROR(INDEX(May!C:C,MATCH(Year!A:A,May!A:A,0)),\"\")","v":""},{"$f":"IFERROR(INDEX(June!C:C,MATCH(Year!A:A,June!A:A,0)),\"\")","v":""},{"$f":"IFERROR(INDEX(July!C:C,MATCH(Year!A:A,July!A:A,0)),\"\")","v":""},{"$f":"IFERROR(INDEX(Aug!C:C,MATCH(Year!A:A,Aug!A:A,0)),\"\")","v":""},{"$f":"IFERROR(INDEX(Sept!C:C,MATCH(Year!A:A,Sept!A:A,0)),\"\")","v":""},{"$f":"IFERROR(INDEX(Oct!C:C,MATCH(Year!A:A,Oct!A:A,0)),\"\")","v":""},{"$f":"IFERROR(INDEX(Nov!C:C,MATCH(Year!A:A,Nov!A:A,0)),\"\")","v":""},{"$f":"IFERROR(INDEX(Dec!C:C,MATCH(Year!A:A,Dec!A:A,0)),\"\")","v":""},{"$f":"IFERROR(INDEX(Jan!C:C,MATCH(Year!A:A,Jan!A:A,0)),\"\")","v":""},{"$f":"IFERROR(INDEX(Feb!C:C,MATCH(Year!A:A,Feb!A:A,0)),\"\")","v":""},{"$f":"IFERROR(INDEX(March!C:C,MATCH(Year!A:A,March!A:A,0)),\"\")","v":""},"",{"$f":"IF(ISERROR(Q!B17),\"\",Q!B17)","v":0},0]
[{"$f":"IF(ISERROR(Q!A18),\"\",Q!A18)","v":0},{"$f":"IFERROR(INDEX(April!C:C,MATCH(Year!A:A,April!A:A,0)),\"\")","v":""},{"$f":"IFERROR(INDEX(May!C:C,MATCH(Year!A:A,May!A:A,0)),\"\")","v":""},{"$f":"IFERROR(INDEX(June!C:C,MATCH(Year!A:A,June!A:A,0)),\"\")","v":""},{"$f":"IFERROR(INDEX(July!C:C,MATCH(Year!A:A,July!A:A,0)),\"\")","v":""},{"$f":"IFERROR(INDEX(Aug!C:C,MATCH(Year!A:A,Aug!A:A,0)),\"\")","v":""},{"$f":"IFERROR(INDEX(Sept!C:C,MATCH(Year!A:A,Sept!A:A,0)),\"\")","v":""},{"$f":"IFERROR(INDEX(Oct!C:C,MATCH(Year!A:A,Oct!A:A,0)),\"\")","v":""},{"$f":"IFERROR(INDEX(Nov!C:C,MATCH(Year!A:A,Nov!A:A,0)),\"\")","v":""},{"$f":"IFERROR(INDEX(Dec!C:C,MATCH(Year!A:A,Dec!A:A,0)),\"\")","v":""},{"$f":"IFERROR(INDEX(Jan!C:C,MATCH(Year!A:A,Jan!A:A,0)),\"\")","v":""},{"$f":"IFERROR(INDEX(Feb!C:C,MATCH(Year!A:A,Feb!A:A,0)),\"\")","v":""},{"$f":"IFERROR(INDEX(March!C:C,MATCH(Year!A:A,March!A:A,0)),\"\")","v":""},"",{"$f":"IF(ISERROR(Q!B18),\"\",Q!B18)","v":0},0]
[{"$f":"IF(ISERROR(Q!A19),\"\",Q!A19)","v":0},{"$f":"IFERROR(INDEX(April!C:C,MATCH(Year!A:A,April!A:A,0)),\"\")","v":""},{"$f":"IFERROR(INDEX(May!C:C,MATCH(Year!A:A,May!A:A,0)),\"\")","v":""},{"$f":"IFERROR(INDEX(June!C:C,MATCH(Year!A:A,June!A:A,0)),\"\")","v":""},{"$f":"IFERROR(INDEX(July!C:C,MATCH(Year!A:A,July!A:A,0)),\"\")","v":""},{"$f":"IFERROR(INDEX(Aug!C:C,MATCH(Year!A:A,Aug!A:A,0)),\"\")","v":""},{"$f":"IFERROR(INDEX(Sept!C:C,MATCH(Year!A:A,Sept!A:A,0)),\"\")","v":""},{"$f":"IFERROR(INDEX(Oct!C:C,MATCH(Year!A:A,Oct!A:A,0)),\"\")","v":""},{"$f":"IFERROR(INDEX(Nov!C:C,MATCH(Year!A:A,Nov!A:A,0)),\"\")","v":""},{"$f":"IFERROR(INDEX(Dec!C:C,MATCH(Year!A:A,Dec!A:A,0)),\"\")","v":""},{"$f":"IFERROR(INDEX(Jan!C:C,MATCH(Year!A:A,Jan!A:A,0)),\"\")","v":""},{"$f":"IFERROR(INDEX(Feb!C:C,MATCH(Year!A:A,Feb!A:A,0)),\"\")","v":""},{"$f":"IFERROR(INDEX(March!C:C,MATCH(Year!A:A,March!A:A,0)),\"\")","v":""},"",{"$f":"IF(ISERROR(Q!B19),\"\",Q!B19)","v":0},0]
[{"$f":"IF(ISERROR(Q!A20),\"\",Q!A20)","v":0},{"$f":"IFERROR(INDEX(April!C:C,MATCH(Year!A:A,April!A:A,0)),\"\")","v":""},{"$f":"IFERROR(INDEX(May!C:C,MATCH(Year!A:A,May!A:A,0)),\"\")","v":""},{"$f":"IFERROR(INDEX(June!C:C,MATCH(Year!A:A,June!A:A,0)),\"\")","v":""},{"$f":"IFERROR(INDEX(July!C:C,MATCH(Year!A:A,July!A:A,0)),\"\")","v":""},{"$f":"IFERROR(INDEX(Aug!C:C,MATCH(Year!A:A,Aug!A:A,0)),\"\")","v":""},{"$f":"IFERROR(INDEX(Sept!C:C,MATCH(Year!A:A,Sept!A:A,0)),\"\")","v":""},{"$f":"IFERROR(INDEX(Oct!C:C,MATCH(Year!A:A,Oct!A:A,0)),\"\")","v":""},{"$f":"IFERROR(INDEX(Nov!C:C,MATCH(Year!A:A,Nov!A:A,0)),\"\")","v":""},{"$f":"IFERROR(INDEX(Dec!C:C,MATCH(Year!A:A,Dec!A:A,0)),\"\")","v":""},{"$f":"IFERROR(INDEX(Jan!C:C,MATCH(Year!A:A,Jan!A:A,0)),\"\")","v":""},{"$f":"IFERROR(INDEX(Feb!C:C,MATCH(Year!A:A,Feb!A:A,0)),\"\")","v":""},{"$f":"IFERROR(INDEX(March!C:C,MATCH(Year!A:A,March!A:A,0)),\"\")","v":""},"",{"$f":"IF(ISERROR(Q!B20),\"\",Q!B20)","v":0},0]
[{"$f":"IF(ISERROR(Q!A21),\"\",Q!A21)","v":0},{"$f":"IFERROR(INDEX(April!C:C,MATCH(Year!A:A,April!A:A,0)),\"\")","v":""},{"$f":"IFERROR(INDEX(May!C:C,MATCH(Year!A:A,May!A:A,0)),\"\")","v":""},{"$f":"IFERROR(INDEX(June!C:C,MATCH(Year!A:A,June!A:A,0)),\"\")","v":""},{"$f":"IFERROR(INDEX(July!C:C,MATCH(Year!A:A,July!A:A,0)),\"\")","v":""},{"$f":"IFERROR(INDEX(Aug!C:C,MATCH(Year!A:A,Aug!A:A,0)),\"\")","v":""},{"$f":"IFERROR(INDEX(Sept!C:C,MATCH(Year!A:A,Sept!A:A,0)),\"\")","v":""},{"$f":"IFERROR(INDEX(Oct!C:C,MATCH(Year!A:A,Oct!A:A,0)),\"\")","v":""},{"$f":"IFERROR(INDEX(Nov!C:C,MATCH(Year!A:A,Nov!A:A,0)),\"\")","v":""},{"$f":"IFERROR(INDEX(Dec!C:C,MATCH(Year!A:A,Dec!A:A,0)),\"\")","v":""},{"$f":"IFERROR(INDEX(Jan!C:C,MATCH(Year!A:A,Jan!A:A,0)),\"\")","v":""},{"$f":"IFERROR(INDEX(Feb!C:C,MATCH(Year!A:A,Feb!A:A,0)),\"\")","v":""},{"$f":"IFERROR(INDEX(March!C:C,MATCH(Year!A:A,March!A:A,0)),\"\")","v":""},"",{"$f":"IF(ISERROR(Q!B21),\"\",Q!B21)","v":0},0]
[{"$f":"IF(ISERROR(Q!A22),\"\",Q!A22)","v":0},{"$f":"IFERROR(INDEX(April!C:C,MATCH(Year!A:A,April!A:A,0)),\"\")","v":""},{"$f":"IFERROR(INDEX(May!C:C,MATCH(Year!A:A,May!A:A,0)),\"\")","v":""},{"$f":"IFERROR(INDEX(June!C:C,MATCH(Year!A:A,June!A:A,0)),\"\")","v":""},{"$f":"IFERROR(INDEX(July!C:C,MATCH(Year!A:A,July!A:A,0)),\"\")","v":""},{"$f":"IFERROR(INDEX(Aug!C:C,MATCH(Year!A:A,Aug!A:A,0)),\"\")","v":""},{"$f":"IFERROR(INDEX(Sept!C:C,MATCH(Year!A:A,Sept!A:A,0)),\"\")","v":""},{"$f":"IFERROR(INDEX(Oct!C:C,MATCH(Year!A:A,Oct!A:A,0)),\"\")","v":""},{"$f":"IFERROR(INDEX(Nov!C:C,MATCH(Year!A:A,Nov!A:A,0)),\"\")","v":""},{"$f":"IFERROR(INDEX(Dec!C:C,MATCH(Year!A:A,Dec!A:A,0)),\"\")","v":""},{"$f":"IFERROR(INDEX(Jan!C:C,MATCH(Year!A:A,Jan!A:A,0)),\"\")","v":""},{"$f":"IFERROR(INDEX(Feb!C:C,MATCH(Year!A:A,Feb!A:A,0)),\"\")","v":""},{"$f":"IFERROR(INDEX(March!C:C,MATCH(Year!A:A,March!A:A,0)),\"\")","v":""},"",{"$f":"IF(ISERROR(Q!B22),\"\",Q!B22)","v":0},0]
[{"$f":"IF(ISERROR(Q!A23),\"\",Q!A23)","v":0},{"$f":"IFERROR(INDEX(April!C:C,MATCH(Year!A:A,April!A:A,0)),\"\")","v":""},{"$f":"IFERROR(INDEX(May!C:C,MATCH(Year!A:A,May!A:A,0)),\"\")","v":""},{"$f":"IFERROR(INDEX(June!C:C,MATCH(Year!A:A,June!A:A,0)),\"\")","v":""},{"$f":"IFERROR(INDEX(July!C:C,MATCH(Year!A:A,July!A:A,0)),\"\")","v":""},{"$f":"IFERROR(INDEX(Aug!C:C,MATCH(Year!A:A,Aug!A:A,0)),\"\")","v":""},{"$f":"IFERROR(INDEX(Sept!C:C,MATCH(Year!A:A,Sept!A:A,0)),\"\")","v":""},{"$f":"IFERROR(INDEX(Oct!C:C,MATCH(Year!A:A,Oct!A:A,0)),\"\")","v":""},{"$f":"IFERROR(INDEX(Nov!C:C,MATCH(Year!A:A,Nov!A:A,0)),\"\")","v":""},{"$f":"IFERROR(INDEX(Dec!C:C,MATCH(Year!A:A,Dec!A:A,0)),\"\")","v":""},{"$f":"IFERROR(INDEX(Jan!C:C,MATCH(Year!A:A,Jan!A:A,0)),\"\")","v":""},{"$f":"IFERROR(INDEX(Feb!C:C,MATCH(Year!A:A,Feb!A:A,0)),\"\")","v":""},{"$f":"IFERROR(INDEX(March!C:C,MATCH(Year!A:A,March!A:A,0)),\"\")","v":""},"",{"$f":"IF(ISERROR(Q!B23),\"\",Q!B23)","v":0},0]
[{"$f":"IF(ISERROR(Q!A24),\"\",Q!A24)","v":0},{"$f":"IFERROR(INDEX(April!C:C,MATCH(Year!A:A,April!A:A,0)),\"\")","v":""},{"$f":"IFERROR(INDEX(May!C:C,MATCH(Year!A:A,May!A:A,0)),\"\")","v":""},{"$f":"IFERROR(INDEX(June!C:C,MATCH(Year!A:A,June!A:A,0)),\"\")","v":""},{"$f":"IFERROR(INDEX(July!C:C,MATCH(Year!A:A,July!A:A,0)),\"\")","v":""},{"$f":"IFERROR(INDEX(Aug!C:C,MATCH(Year!A:A,Aug!A:A,0)),\"\")","v":""},{"$f":"IFERROR(INDEX(Sept!C:C,MATCH(Year!A:A,Sept!A:A,0)),\"\")","v":""},{"$f":"IFERROR(INDEX(Oct!C:C,MATCH(Year!A:A,Oct!A:A,0)),\"\")","v":""},{"$f":"IFERROR(INDEX(Nov!C:C,MATCH(Year!A:A,Nov!A:A,0)),\"\")","v":""},{"$f":"IFERROR(INDEX(Dec!C:C,MATCH(Year!A:A,Dec!A:A,0)),\"\")","v":""},{"$f":"IFERROR(INDEX(Jan!C:C,MATCH(Year!A:A,Jan!A:A,0)),\"\")","v":""},{"$f":"IFERROR(INDEX(Feb!C:C,MATCH(Year!A:A,Feb!A:A,0)),\"\")","v":""},{"$f":"IFERROR(INDEX(March!C:C,MATCH(Year!A:A,March!A:A,0)),\"\")","v":""},"",{"$f":"IF(ISERROR(Q!B24),\"\",Q!B24)","v":0},0]
[{"$f":"IF(ISERROR(Q!A25),\"\",Q!A25)","v":0},{"$f":"IFERROR(INDEX(April!C:C,MATCH(Year!A:A,April!A:A,0)),\"\")","v":""},{"$f":"IFERROR(INDEX(May!C:C,MATCH(Year!A:A,May!A:A,0)),\"\")","v":""},{"$f":"IFERROR(INDEX(June!C:C,MATCH(Year!A:A,June!A:A,0)),\"\")","v":""},{"$f":"IFERROR(INDEX(July!C:C,MATCH(Year!A:A,July!A:A,0)),\"\")","v":""},{"$f":"IFERROR(INDEX(Aug!C:C,MATCH(Year!A:A,Aug!A:A,0)),\"\")","v":""},{"$f":"IFERROR(INDEX(Sept!C:C,MATCH(Year!A:A,Sept!A:A,0)),\"\")","v":""},{"$f":"IFERROR(INDEX(Oct!C:C,MATCH(Year!A:A,Oct!A:A,0)),\"\")","v":""},{"$f":"IFERROR(INDEX(Nov!C:C,MATCH(Year!A:A,Nov!A:A,0)),\"\")","v":""},{"$f":"IFERROR(INDEX(Dec!C:C,MATCH(Year!A:A,Dec!A:A,0)),\"\")","v":""},{"$f":"IFERROR(INDEX(Jan!C:C,MATCH(Year!A:A,Jan!A:A,0)),\"\")","v":""},{"$f":"IFERROR(INDEX(Feb!C:C,MATCH(Year!A:A,Feb!A:A,0)),\"\")","v":""},{"$f":"IFERROR(INDEX(March!C:C,MATCH(Year!A:A,March!A:A,0)),\"\")","v":""},"",{"$f":"IF(ISERROR(Q!B25),\"\",Q!B25)","v":0},0]
[{"$f":"IF(ISERROR(Q!A26),\"\",Q!A26)","v":0},{"$f":"IFERROR(INDEX(April!C:C,MATCH(Year!A:A,April!A:A,0)),\"\")","v":""},{"$f":"IFERROR(INDEX(May!C:C,MATCH(Year!A:A,May!A:A,0)),\"\")","v":""},{"$f":"IFERROR(INDEX(June!C:C,MATCH(Year!A:A,June!A:A,0)),\"\")","v":""},{"$f":"IFERROR(INDEX(July!C:C,MATCH(Year!A:A,July!A:A,0)),\"\")","v":""},{"$f":"IFERROR(INDEX(Aug!C:C,MATCH(Year!A:A,Aug!A:A,0)),\"\")","v":""},{"$f":"IFERROR(INDEX(Sept!C:C,MATCH(Year!A:A,Sept!A:A,0)),\"\")","v":""},{"$f":"IFERROR(INDEX(Oct!C:C,MATCH(Year!A:A,Oct!A:A,0)),\"\")","v":""},{"$f":"IFERROR(INDEX(Nov!C:C,MATCH(Year!A:A,Nov!A:A,0)),\"\")","v":""},{"$f":"IFERROR(INDEX(Dec!C:C,MATCH(Year!A:A,Dec!A:A,0)),\"\")","v":""},{"$f":"IFERROR(INDEX(Jan!C:C,MATCH(Year!A:A,Jan!A:A,0)),\"\")","v":""},{"$f":"IFERROR(INDEX(Feb!C:C,MATCH(Year!A:A,Feb!A:A,0)),\"\")","v":""},{"$f":"IFERROR(INDEX(March!C:C,MATCH(Year!A:A,March!A:A,0)),\"\")","v":""},"",{"$f":"IF(ISERROR(Q!B26),\"\",Q!B26)","v":0},0]
[{"$f":"IF(ISERROR(Q!A27),\"\",Q!A27)","v":0},{"$f":"IFERROR(INDEX(April!C:C,MATCH(Year!A:A,April!A:A,0)),\"\")","v":""},{"$f":"IFERROR(INDEX(May!C:C,MATCH(Year!A:A,May!A:A,0)),\"\")","v":""},{"$f":"IFERROR(INDEX(June!C:C,MATCH(Year!A:A,June!A:A,0)),\"\")","v":""},{"$f":"IFERROR(INDEX(July!C:C,MATCH(Year!A:A,July!A:A,0)),\"\")","v":""},{"$f":"IFERROR(INDEX(Aug!C:C,MATCH(Year!A:A,Aug!A:A,0)),\"\")","v":""},{"$f":"IFERROR(INDEX(Sept!C:C,MATCH(Year!A:A,Sept!A:A,0)),\"\")","v":""},{"$f":"IFERROR(INDEX(Oct!C:C,MATCH(Year!A:A,Oct!A:A,0)),\"\")","v":""},{"$f":"IFERROR(INDEX(Nov!C:C,MATCH(Year!A:A,Nov!A:A,0)),\"\")","v":""},{"$f":"IFERROR(INDEX(Dec!C:C,MATCH(Year!A:A,Dec!A:A,0)),\"\")","v":""},{"$f":"IFERROR(INDEX(Jan!C:C,MATCH(Year!A:A,Jan!A:A,0)),\"\")","v":""},{"$f":"IFERROR(INDEX(Feb!C:C,MATCH(Year!A:A,Feb!A:A,0)),\"\")","v":""},{"$f":"IFERROR(INDEX(March!C:C,MATCH(Year!A:A,March!A:A,0)),\"\")","v":""},"",{"$f":"IF(ISERROR(Q!B27),\"\",Q!B27)","v":0},0]
[{"$f":"IF(ISERROR(Q!A28),\"\",Q!A28)","v":0},{"$f":"IFERROR(INDEX(April!C:C,MATCH(Year!A:A,April!A:A,0)),\"\")","v":""},{"$f":"IFERROR(INDEX(May!C:C,MATCH(Year!A:A,May!A:A,0)),\"\")","v":""},{"$f":"IFERROR(INDEX(June!C:C,MATCH(Year!A:A,June!A:A,0)),\"\")","v":""},{"$f":"IFERROR(INDEX(July!C:C,MATCH(Year!A:A,July!A:A,0)),\"\")","v":""},{"$f":"IFERROR(INDEX(Aug!C:C,MATCH(Year!A:A,Aug!A:A,0)),\"\")","v":""},{"$f":"IFERROR(INDEX(Sept!C:C,MATCH(Year!A:A,Sept!A:A,0)),\"\")","v":""},{"$f":"IFERROR(INDEX(Oct!C:C,MATCH(Year!A:A,Oct!A:A,0)),\"\")","v":""},{"$f":"IFERROR(INDEX(Nov!C:C,MATCH(Year!A:A,Nov!A:A,0)),\"\")","v":""},{"$f":"IFERROR(INDEX(Dec!C:C,MATCH(Year!A:A,Dec!A:A,0)),\"\")","v":""},{"$f":"IFERROR(INDEX(Jan!C:C,MATCH(Year!A:A,Jan!A:A,0)),\"\")","v":""},{"$f":"IFERROR(INDEX(Feb!C:C,MATCH(Year!A:A,Feb!A:A,0)),\"\")","v":""},{"$f":"IFERROR(INDEX(March!C:C,MATCH(Year!A:A,March!A:A,0)),\"\")","v":""},"",{"$f":"IF(ISERROR(Q!B28),\"\",Q!B28)","v":0},0]
[{"$f":"IF(ISERROR(Q!A29),\"\",Q!A29)","v":0},{"$f":"IFERROR(INDEX(April!C:C,MATCH(Year!A:A,April!A:A,0)),\"\")","v":""},{"$f":"IFERROR(INDEX(May!C:C,MATCH(Year!A:A,May!A:A,0)),\"\")","v":""},{"$f":"IFERROR(INDEX(June!C:C,MATCH(Year!A:A,June!A:A,0)),\"\")","v":""},{"$f":"IFERROR(INDEX(July!C:C,MATCH(Year!A:A,July!A:A,0)),\"\")","v":""},{"$f":"IFERROR(INDEX(Aug!C:C,MATCH(Year!A:A,Aug!A:A,0)),\"\")","v":""},{"$f":"IFERROR(INDEX(Sept!C:C,MATCH(Year!A:A,Sept!A:A,0)),\"\")","v":""},{"$f":"IFERROR(INDEX(Oct!C:C,MATCH(Year!A:A,Oct!A:A,0)),\"\")","v":""},{"$f":"IFERROR(INDEX(Nov!C:C,MATCH(Year!A:A,Nov!A:A,0)),\"\")","v":""},{"$f":"IFERROR(INDEX(Dec!C:C,MATCH(Year!A:A,Dec!A:A,0)),\"\")","v":""},{"$f":"IFERROR(INDEX(Jan!C:C,MATCH(Year!A:A,Jan!A:A,0)),\"\")","v":""},{"$f":"IFERROR(INDEX(Feb!C:C,MATCH(Year!A:A,Feb!A:A,0)),\"\")","v":""},{"$f":"IFERROR(INDEX(March!C:C,MATCH(Year!A:A,March!A:A,0)),\"\")","v":""},"",{"$f":"IF(ISERROR(Q!B29),\"\",Q!B29)","v":0},0]
[{"$f":"IF(ISERROR(Q!A30),\"\",Q!A30)","v":0},{"$f":"IFERROR(INDEX(April!C:C,MATCH(Year!A:A,April!A:A,0)),\"\")","v":""},{"$f":"IFERROR(INDEX(May!C:C,MATCH(Year!A:A,May!A:A,0)),\"\")","v":""},{"$f":"IFERROR(INDEX(June!C:C,MATCH(Year!A:A,June!A:A,0)),\"\")","v":""},{"$f":"IFERROR(INDEX(July!C:C,MATCH(Year!A:A,July!A:A,0)),\"\")","v":""},{"$f":"IFERROR(INDEX(Aug!C:C,MATCH(Year!A:A,Aug!A:A,0)),\"\")","v":""},{"$f":"IFERROR(INDEX(Sept!C:C,MATCH(Year!A:A,Sept!A:A,0)),\"\")","v":""},{"$f":"IFERROR(INDEX(Oct!C:C,MATCH(Year!A:A,Oct!A:A,0)),\"\")","v":""},{"$f":"IFERROR(INDEX(Nov!C:C,MATCH(Year!A:A,Nov!A:A,0)),\"\")","v":""},{"$f":"IFERROR(INDEX(Dec!C:C,MATCH(Year!A:A,Dec!A:A,0)),\"\")","v":""},{"$f":"IFERROR(INDEX(Jan!C:C,MATCH(Year!A:A,Jan!A:A,0)),\"\")","v":""},{"$f":"IFERROR(INDEX(Feb!C:C,MATCH(Year!A:A,Feb!A:A,0)),\"\")","v":""},{"$f":"IFERROR(INDEX(March!C:C,MATCH(Year!A:A,March!A:A,0)),\"\")","v":""},"",{"$f":"IF(ISERROR(Q!B30),\"\",Q!B30)","v":0},0]
[{"$f":"IF(ISERROR(Q!A31),\"\",Q!A31)","v":0},{"$f":"IFERROR(INDEX(April!C:C,MATCH(Year!A:A,April!A:A,0)),\"\")","v":""},{"$f":"IFERROR(INDEX(May!C:C,MATCH(Year!A:A,May!A:A,0)),\"\")","v":""},{"$f":"IFERROR(INDEX(June!C:C,MATCH(Year!A:A,June!A:A,0)),\"\")","v":""},{"$f":"IFERROR(INDEX(July!C:C,MATCH(Year!A:A,July!A:A,0)),\"\")","v":""},{"$f":"IFERROR(INDEX(Aug!C:C,MATCH(Year!A:A,Aug!A:A,0)),\"\")","v":""},{"$f":"IFERROR(INDEX(Sept!C:C,MATCH(Year!A:A,Sept!A:A,0)),\"\")","v":""},{"$f":"IFERROR(INDEX(Oct!C:C,MATCH(Year!A:A,Oct!A:A,0)),\"\")","v":""},{"$f":"IFERROR(INDEX(Nov!C:C,MATCH(Year!A:A,Nov!A:A,0)),\"\")","v":""},{"$f":"IFERROR(INDEX(Dec!C:C,MATCH(Year!A:A,Dec!A:A,0)),\"\")","v":""},{"$f":"IFERROR(INDEX(Jan!C:C,MATCH(Year!A:A,Jan!A:A,0)),\"\")","v":""},{"$f":"IFERROR(INDEX(Feb!C:C,MATCH(Year!A:A,Feb!A:A,0)),\"\")","v":""},{"$f":"IFERROR(INDEX(March!C:C,MATCH(Year!A:A,March!A:A,0)),\"\")","v":""},"",{"$f":"IF(ISERROR(Q!B31),\"\",Q!B31)","v":0},0]
[{"$f":"IF(ISERROR(Q!A32),\"\",Q!A32)","v":0},{"$f":"IFERROR(INDEX(April!C:C,MATCH(Year!A:A,April!A:A,0)),\"\")","v":""},{"$f":"IFERROR(INDEX(May!C:C,MATCH(Year!A:A,May!A:A,0)),\"\")","v":""},{"$f":"IFERROR(INDEX(June!C:C,MATCH(Year!A:A,June!A:A,0)),\"\")","v":""},{"$f":"IFERROR(INDEX(July!C:C,MATCH(Year!A:A,July!A:A,0)),\"\")","v":""},{"$f":"IFERROR(INDEX(Aug!C:C,MATCH(Year!A:A,Aug!A:A,0)),\"\")","v":""},{"$f":"IFERROR(INDEX(Sept!C:C,MATCH(Year!A:A,Sept!A:A,0)),\"\")","v":""},{"$f":"IFERROR(INDEX(Oct!C:C,MATCH(Year!A:A,Oct!A:A,0)),\"\")","v":""},{"$f":"IFERROR(INDEX(Nov!C:C,MATCH(Year!A:A,Nov!A:A,0)),\"\")","v":""},{"$f":"IFERROR(INDEX(Dec!C:C,MATCH(Year!A:A,Dec!A:A,0)),\"\")","v":""},{"$f":"IFERROR(INDEX(Jan!C:C,MATCH(Year!A:A,Jan!A:A,0)),\"\")","v":""},{"$f":"IFERROR(INDEX(Feb!C:C,MATCH(Year!A:A,Feb!A:A,0)),\"\")","v":""},{"$f":"IFERROR(INDEX(March!C:C,MATCH(Year!A:A,March!A:A,0)),\"\")","v":""},"",{"$f":"IF(ISERROR(Q!B32),\"\",Q!B32)","v":0},0]
[{"$f":"IF(ISERROR(Q!A33),\"\",Q!A33)","v":0},{"$f":"IFERROR(INDEX(April!C:C,MATCH(Year!A:A,April!A:A,0)),\"\")","v":""},{"$f":"IFERROR(INDEX(May!C:C,MATCH(Year!A:A,May!A:A,0)),\"\")","v":""},{"$f":"IFERROR(INDEX(June!C:C,MATCH(Year!A:A,June!A:A,0)),\"\")","v":""},{"$f":"IFERROR(INDEX(July!C:C,MATCH(Year!A:A,July!A:A,0)),\"\")","v":""},{"$f":"IFERROR(INDEX(Aug!C:C,MATCH(Year!A:A,Aug!A:A,0)),\"\")","v":""},{"$f":"IFERROR(INDEX(Sept!C:C,MATCH(Year!A:A,Sept!A:A,0)),\"\")","v":""},{"$f":"IFERROR(INDEX(Oct!C:C,MATCH(Year!A:A,Oct!A:A,0)),\"\")","v":""},{"$f":"IFERROR(INDEX(Nov!C:C,MATCH(Year!A:A,Nov!A:A,0)),\"\")","v":""},{"$f":"IFERROR(INDEX(Dec!C:C,MATCH(Year!A:A,Dec!A:A,0)),\"\")","v":""},{"$f":"IFERROR(INDEX(Jan!C:C,MATCH(Year!A:A,Jan!A:A,0)),\"\")","v":""},{"$f":"IFERROR(INDEX(Feb!C:C,MATCH(Year!A:A,Feb!A:A,0)),\"\")","v":""},{"$f":"IFERROR(INDEX(March!C:C,MATCH(Year!A:A,March!A:A,0)),\"\")","v":""},"",{"$f":"IF(ISERROR(Q!B33),\"\",Q!B33)","v":0},0]
[{"$f":"IF(ISERROR(Q!A34),\"\",Q!A34)","v":0},{"$f":"IFERROR(INDEX(April!C:C,MATCH(Year!A:A,April!A:A,0)),\"\")","v":""},{"$f":"IFERROR(INDEX(May!C:C,MATCH(Year!A:A,May!A:A,0)),\"\")","v":""},{"$f":"IFERROR(INDEX(June!C:C,MATCH(Year!A:A,June!A:A,0)),\"\")","v":""},{"$f":"IFERROR(INDEX(July!C:C,MATCH(Year!A:A,July!A:A,0)),\"\")","v":""},{"$f":"IFERROR(INDEX(Aug!C:C,MATCH(Year!A:A,Aug!A:A,0)),\"\")","v":""},{"$f":"IFERROR(INDEX(Sept!C:C,MATCH(Year!A:A,Sept!A:A,0)),\"\")","v":""},{"$f":"IFERROR(INDEX(Oct!C:C,MATCH(Year!A:A,Oct!A:A,0)),\"\")","v":""},{"$f":"IFERROR(INDEX(Nov!C:C,MATCH(Year!A:A,Nov!A:A,0)),\"\")","v":""},{"$f":"IFERROR(INDEX(Dec!C:C,MATCH(Year!A:A,Dec!A:A,0)),\"\")","v":""},{"$f":"IFERROR(INDEX(Jan!C:C,MATCH(Year!A:A,Jan!A:A,0)),\"\")","v":""},{"$f":"IFERROR(INDEX(Feb!C:C,MATCH(Year!A:A,Feb!A:A,0)),\"\")","v":""},{"$f":"IFERROR(INDEX(March!C:C,MATCH(Year!A:A,March!A:A,0)),\"\")","v":""},"",{"$f":"IF(ISERROR(Q!B34),\"\",Q!B34)","v":0},0]
[{"$f":"IF(ISERROR(Q!A35),\"\",Q!A35)","v":0},{"$f":"IFERROR(INDEX(April!C:C,MATCH(Year!A:A,April!A:A,0)),\"\")","v":""},{"$f":"IFERROR(INDEX(May!C:C,MATCH(Year!A:A,May!A:A,0)),\"\")","v":""},{"$f":"IFERROR(INDEX(June!C:C,MATCH(Year!A:A,June!A:A,0)),\"\")","v":""},{"$f":"IFERROR(INDEX(July!C:C,MATCH(Year!A:A,July!A:A,0)),\"\")","v":""},{"$f":"IFERROR(INDEX(Aug!C:C,MATCH(Year!A:A,Aug!A:A,0)),\"\")","v":""},{"$f":"IFERROR(INDEX(Sept!C:C,MATCH(Year!A:A,Sept!A:A,0)),\"\")","v":""},{"$f":"IFERROR(INDEX(Oct!C:C,MATCH(Year!A:A,Oct!A:A,0)),\"\")","v":""},{"$f":"IFERROR(INDEX(Nov!C:C,MATCH(Year!A:A,Nov!A:A,0)),\"\")","v":""},{"$f":"IFERROR(INDEX(Dec!C:C,MATCH(Year!A:A,Dec!A:A,0)),\"\")","v":""},{"$f":"IFERROR(INDEX(Jan!C:C,MATCH(Year!A:A,Jan!A:A,0)),\"\")","v":""},{"$f":"IFERROR(INDEX(Feb!C:C,MATCH(Year!A:A,Feb!A:A,0)),\"\")","v":""},{"$f":"IFERROR(INDEX(March!C:C,MATCH(Year!A:A,March!A:A,0)),\"\")","v":""},"",{"$f":"IF(ISERROR(Q!B35),\"\",Q!B35)","v":0},0]
[{"$f":"IF(ISERROR(Q!A36),\"\",Q!A36)","v":0},{"$f":"IFERROR(INDEX(April!C:C,MATCH(Year!A:A,April!A:A,0)),\"\")","v":""},{"$f":"IFERROR(INDEX(May!C:C,MATCH(Year!A:A,May!A:A,0)),\"\")","v":""},{"$f":"IFERROR(INDEX(June!C:C,MATCH(Year!A:A,June!A:A,0)),\"\")","v":""},{"$f":"IFERROR(INDEX(July!C:C,MATCH(Year!A:A,July!A:A,0)),\"\")","v":""},{"$f":"IFERROR(INDEX(Aug!C:C,MATCH(Year!A:A,Aug!A:A,0)),\"\")","v":""},{"$f":"IFERROR(INDEX(Sept!C:C,MATCH(Year!A:A,Sept!A:A,0)),\"\")","v":""},{"$f":"IFERROR(INDEX(Oct!C:C,MATCH(Year!A:A,Oct!A:A,0)),\"\")","v":""},{"$f":"IFERROR(INDEX(Nov!C:C,MATCH(Year!A:A,Nov!A:A,0)),\"\")","v":""},{"$f":"IFERROR(INDEX(Dec!C:C,MATCH(Year!A:A,Dec!A:A,0)),\"\")","v":""},{"$f":"IFERROR(INDEX(Jan!C:C,MATCH(Year!A:A,Jan!A:A,0)),\"\")","v":""},{"$f":"IFERROR(INDEX(Feb!C:C,MATCH(Year!A:A,Feb!A:A,0)),\"\")","v":""},{"$f":"IFERROR(INDEX(March!C:C,MATCH(Year!A:A,March!A:A,0)),\"\")","v":""},"",{"$f":"IF(ISERROR(Q!B36),\"\",Q!B36)","v":0},0]
[{"$f":"IF(ISERROR(Q!A37),\"\",Q!A37)","v":0},{"$f":"IFERROR(INDEX(April!C:C,MATCH(Year!A:A,April!A:A,0)),\"\")","v":""},{"$f":"IFERROR(INDEX(May!C:C,MATCH(Year!A:A,May!A:A,0)),\"\")","v":""},{"$f":"IFERROR(INDEX(June!C:C,MATCH(Year!A:A,June!A:A,0)),\"\")","v":""},{"$f":"IFERROR(INDEX(July!C:C,MATCH(Year!A:A,July!A:A,0)),\"\")","v":""},{"$f":"IFERROR(INDEX(Aug!C:C,MATCH(Year!A:A,Aug!A:A,0)),\"\")","v":""},{"$f":"IFERROR(INDEX(Sept!C:C,MATCH(Year!A:A,Sept!A:A,0)),\"\")","v":""},{"$f":"IFERROR(INDEX(Oct!C:C,MATCH(Year!A:A,Oct!A:A,0)),\"\")","v":""},{"$f":"IFERROR(INDEX(Nov!C:C,MATCH(Year!A:A,Nov!A:A,0)),\"\")","v":""},{"$f":"IFERROR(INDEX(Dec!C:C,MATCH(Year!A:A,Dec!A:A,0)),\"\")","v":""},{"$f":"IFERROR(INDEX(Jan!C:C,MATCH(Year!A:A,Jan!A:A,0)),\"\")","v":""},{"$f":"IFERROR(INDEX(Feb!C:C,MATCH(Year!A:A,Feb!A:A,0)),\"\")","v":""},{"$f":"IFERROR(INDEX(March!C:C,MATCH(Year!A:A,March!A:A,0)),\"\")","v":""},"",{"$f":"IF(ISERROR(Q!B37),\"\",Q!B37)","v":0},0]
[{"$f":"IF(ISERROR(Q!A38),\"\",Q!A38)","v":0},{"$f":"IFERROR(INDEX(April!C:C,MATCH(Year!A:A,April!A:A,0)),\"\")","v":""},{"$f":"IFERROR(INDEX(May!C:C,MATCH(Year!A:A,May!A:A,0)),\"\")","v":""},{"$f":"IFERROR(INDEX(June!C:C,MATCH(Year!A:A,June!A:A,0)),\"\")","v":""},{"$f":"IFERROR(INDEX(July!C:C,MATCH(Year!A:A,July!A:A,0)),\"\")","v":""},{"$f":"IFERROR(INDEX(Aug!C:C,MATCH(Year!A:A,Aug!A:A,0)),\"\")","v":""},{"$f":"IFERROR(INDEX(Sept!C:C,MATCH(Year!A:A,Sept!A:A,0)),\"\")","v":""},{"$f":"IFERROR(INDEX(Oct!C:C,MATCH(Year!A:A,Oct!A:A,0)),\"\")","v":""},{"$f":"IFERROR(INDEX(Nov!C:C,MATCH(Year!A:A,Nov!A:A,0)),\"\")","v":""},{"$f":"IFERROR(INDEX(Dec!C:C,MATCH(Year!A:A,Dec!A:A,0)),\"\")","v":""},{"$f":"IFERROR(INDEX(Jan!C:C,MATCH(Year!A:A,Jan!A:A,0)),\"\")","v":""},{"$f":"IFERROR(INDEX(Feb!C:C,MATCH(Year!A:A,Feb!A:A,0)),\"\")","v":""},{"$f":"IFERROR(INDEX(March!C:C,MATCH(Year!A:A,March!A:A,0)),\"\")","v":""},"",{"$f":"IF(ISERROR(Q!B38),\"\",Q!B38)","v":0},0]
[{"$f":"IF(ISERROR(Q!A39),\"\",Q!A39)","v":0},{"$f":"IFERROR(INDEX(April!C:C,MATCH(Year!A:A,April!A:A,0)),\"\")","v":""},{"$f":"IFERROR(INDEX(May!C:C,MATCH(Year!A:A,May!A:A,0)),\"\")","v":""},{"$f":"IFERROR(INDEX(June!C:C,MATCH(Year!A:A,June!A:A,0)),\"\")","v":""},{"$f":"IFERROR(INDEX(July!C:C,MATCH(Year!A:A,July!A:A,0)),\"\")","v":""},{"$f":"IFERROR(INDEX(Aug!C:C,MATCH(Year!A:A,Aug!A:A,0)),\"\")","v":""},{"$f":"IFERROR(INDEX(Sept!C:C,MATCH(Year!A:A,Sept!A:A,0)),\"\")","v":""},{"$f":"IFERROR(INDEX(Oct!C:C,MATCH(Year!A:A,Oct!A:A,0)),\"\")","v":""},{"$f":"IFERROR(INDEX(Nov!C:C,MATCH(Year!A:A,Nov!A:A,0)),\"\")","v":""},{"$f":"IFERROR(INDEX(Dec!C:C,MATCH(Year!A:A,Dec!A:A,0)),\"\")","v":""},{"$f":"IFERROR(INDEX(Jan!C:C,MATCH(Year!A:A,Jan!A:A,0)),\"\")","v":""},{"$f":"IFERROR(INDEX(Feb!C:C,MATCH(Year!A:A,Feb!A:A,0)),\"\")","v":""},{"$f":"IFERROR(INDEX(March!C:C,MATCH(Year!A:A,March!A:A,0)),\"\")","v":""},"",{"$f":"IF(ISERROR(Q!B39),\"\",Q!B39)","v":0},0]
[{"$f":"IF(ISERROR(Q!A40),\"\",Q!A40)","v":0},{"$f":"IFERROR(INDEX(April!C:C,MATCH(Year!A:A,April!A:A,0)),\"\")","v":""},{"$f":"IFERROR(INDEX(May!C:C,MATCH(Year!A:A,May!A:A,0)),\"\")","v":""},{"$f":"IFERROR(INDEX(June!C:C,MATCH(Year!A:A,June!A:A,0)),\"\")","v":""},{"$f":"IFERROR(INDEX(July!C:C,MATCH(Year!A:A,July!A:A,0)),\"\")","v":""},{"$f":"IFERROR(INDEX(Aug!C:C,MATCH(Year!A:A,Aug!A:A,0)),\"\")","v":""},{"$f":"IFERROR(INDEX(Sept!C:C,MATCH(Year!A:A,Sept!A:A,0)),\"\")","v":""},{"$f":"IFERROR(INDEX(Oct!C:C,MATCH(Year!A:A,Oct!A:A,0)),\"\")","v":""},{"$f":"IFERROR(INDEX(Nov!C:C,MATCH(Year!A:A,Nov!A:A,0)),\"\")","v":""},{"$f":"IFERROR(INDEX(Dec!C:C,MATCH(Year!A:A,Dec!A:A,0)),\"\")","v":""},{"$f":"IFERROR(INDEX(Jan!C:C,MATCH(Year!A:A,Jan!A:A,0)),\"\")","v":""},{"$f":"IFERROR(INDEX(Feb!C:C,MATCH(Year!A:A,Feb!A:A,0)),\"\")","v":""},{"$f":"IFERROR(INDEX(March!C:C,MATCH(Year!A:A,March!A:A,0)),\"\")","v":""},"",{"$f":"IF(ISERROR(Q!B40),\"\",Q!B40)","v":0},0]
[{"$f":"IF(ISERROR(Q!A41),\"\",Q!A41)","v":0},{"$f":"IFERROR(INDEX(April!C:C,MATCH(Year!A:A,April!A:A,0)),\"\")","v":""},{"$f":"IFERROR(INDEX(May!C:C,MATCH(Year!A:A,May!A:A,0)),\"\")","v":""},{"$f":"IFERROR(INDEX(June!C:C,MATCH(Year!A:A,June!A:A,0)),\"\")","v":""},{"$f":"IFERROR(INDEX(July!C:C,MATCH(Year!A:A,July!A:A,0)),\"\")","v":""},{"$f":"IFERROR(INDEX(Aug!C:C,MATCH(Year!A:A,Aug!A:A,0)),\"\")","v":""},{"$f":"IFERROR(INDEX(Sept!C:C,MATCH(Year!A:A,Sept!A:A,0)),\"\")","v":""},{"$f":"IFERROR(INDEX(Oct!C:C,MATCH(Year!A:A,Oct!A:A,0)),\"\")","v":""},{"$f":"IFERROR(INDEX(Nov!C:C,MATCH(Year!A:A,Nov!A:A,0)),\"\")","v":""},{"$f":"IFERROR(INDEX(Dec!C:C,MATCH(Year!A:A,Dec!A:A,0)),\"\")","v":""},{"$f":"IFERROR(INDEX(Jan!C:C,MATCH(Year!A:A,Jan!A:A,0)),\"\")","v":""},{"$f":"IFERROR(INDEX(Feb!C:C,MATCH(Year!A:A,Feb!A:A,0)),\"\")","v":""},{"$f":"IFERROR(INDEX(March!C:C,MATCH(Year!A:A,March!A:A,0)),\"\")","v":""},"",{"$f":"IF(ISERROR(Q!B41),\"\",Q!B41)","v":0},0]
["Average",{"$f":"IF(ISERROR((SUM(B14:B53)/April!B8)),\"\",(SUM(B14:B53)/April!B8))","v":0.94545454545454533},{"$f":"IF(ISERROR((SUM(C14:C53)/May!B8)),\"\",(SUM(C14:C53)/May!B8))","v":0.93181818181818177},{"$f":"IF(ISERROR((SUM(D14:D53)/June!B8)),\"\",(SUM(D14:D53)/June!B8))","v":0.98181818181818192},{"$f":"IF(ISERROR((SUM(E14:E53)/July!B8)),\"\",(SUM(E14:E53)/July!B8))","v":0.98181818181818192},{"$f":"IF(ISERROR((SUM(F14:F53)/Aug!B8)),\"\",(SUM(F14:F53)/Aug!B8))","v":0.98181818181818192},{"$f":"IF(ISERROR((SUM(G14:G53)/Sept!B8)),\"\",(SUM(G14:G53)/Sept!B8))","v":0.97727272727272729},{"$f":"IF(ISERROR((SUM(H14:H53)/Oct!B8)),\"\",(SUM(H14:H53)/Oct!B8))","v":1},{"$f":"IF(ISERROR((SUM(I14:I53)/Nov!B8)),\"\",(SUM(I14:I53)/Nov!B8))","v":0.97727272727272729},{"$f":"IF(ISERROR((SUM(J14:J53)/Dec!B8)),\"\",(SUM(J14:J53)/Dec!B8))","v":0.96363636363636362},{"$f":"IF(ISERROR((SUM(K14:K53)/Jan!B8)),\"\",(SUM(K14:K53)/Jan!B8))","v":0.96969696969696983},{"$f":"IF(ISERROR((SUM(L14:L53)/Feb!B8)),\"\",(SUM(L14:L53)/Feb!B8))","v":0.94090909090909092},{"$f":"IF(ISERROR((SUM(M14:M53)/March!B8)),\"\",(SUM(M14:M53)/March!B8))","v":0.96969696969696961},{"$f":"IF(ISERROR((SUM(B54:M54))/B4),\"\",(SUM(B54:M54))/B4)","v":0.96843434343434343}]
[]
["Compliant"]
["Metric","April","May","June","July","August","September","October","November","December","January","February","March","Year average"]
[{"$f":"IF(ISERROR(Q!A2),\"\",Q!A2)","v":"Was a Room number documented?"},{"$f":"IFERROR(INDEX(April!D:D,MATCH(Year!A:A,April!A:A,0)),\"\")","v":1},{"$f":"IFERROR(INDEX(May!D:D,MATCH(Year!A:A,May!A:A,0)),\"\")","v":1},{"$f":"IFERROR(INDEX(June!D:D,MATCH(Year!A:A,June!A:A,0)),\"\")","v":1},{"$f":"IFERROR(INDEX(July!D:D,MATCH(Year!A:A,July!A:A,0)),\"\")","v":1},{"$f":"IFERROR(INDEX(Aug!D:D,MATCH(Year!A:A,Aug!A:A,0)),\"\")","v":1},{"$f":"IFERROR(INDEX(Sept!D:D,MATCH(Year!A:A,Sept!A:A,0)),\"\")","v":1},{"$f":"IFERROR(INDEX(Oct!D:D,MATCH(Year!A:A,Oct!A:A,0)),\"\")","v":1},{"$f":"IFERROR(INDEX(Nov!D:D,MATCH(Year!A:A,Nov!A:A,0)),\"\")","v":1},{"$f":"IFERROR(INDEX(Dec!D:D,MATCH(Year!A:A,Dec!A:A,0)),\"\")","v":1},{"$f":"IFERROR(INDEX(Jan!D:D,MATCH(Year!A:A,Jan!A:A,0)),\"\")","v":1},{"$f":"IFERROR(INDEX(Feb!D:D,MATCH(Year!A:A,Feb!A:A,0)),\"\")","v":0.8},{"$f":"IFERROR(INDEX(March!D:D,MATCH(Year!A:A,March!A:A,0)),\"\")","v":1},{"$f":"IF(ISERROR((SUM(B58:M58))/P14),\"\",(SUM(B58:M58))/P14)","v":0.98333333333333339}]
[{"$f":"IF(ISERROR(Q!A3),\"\",Q!A3)","v":"Were stage A checks completed as appropriate?"},{"$f":"IFERROR(INDEX(April!D:D,MATCH(Year!A:A,April!A:A,0)),\"\")","v":1},{"$f":"IFERROR(INDEX(May!D:D,MATCH(Year!A:A,May!A:A,0)),\"\")","v":0.75},{"$f":"IFERROR(INDEX(June!D:D,MATCH(Year!A:A,June!A:A,0)),\"\")","v":1},{"$f":"IFERROR(INDEX(July!D:D,MATCH(Year!A:A,July!A:A,0)),\"\")","v":1},{"$f":"IFERROR(INDEX(Aug!D:D,MATCH(Year!A:A,Aug!A:A,0)),\"\")","v":0.8},{"$f":"IFERROR(INDEX(Sept!D:D,MATCH(Year!A:A,Sept!A:A,0)),\"\")","v":1},{"$f":"IFERROR(INDEX(Oct!D:D,MATCH(Year!A:A,Oct!A:A,0)),\"\")","v":1},{"$f":"IFERROR(INDEX(Nov!D:D,MATCH(Year!A:A,Nov!A:A,0)),\"\")","v":1},{"$f":"IFERROR(INDEX(Dec!D:D,MATCH(Year!A:A,Dec!A:A,0)),\"\")","v":1},{"$f":"IFERROR(INDEX(Jan!D:D,MATCH(Year!A:A,Jan!A:A,0)),\"\")","v":0.83333333333333337},{"$f":"IFERROR(INDEX(Feb!D:D,MATCH(Year!A:A,Feb!A:A,0)),\"\")","v":0.75},{"$f":"IFERROR(INDEX(March!D:D,MATCH(Year!A:A,March!A:A,0)),\"\")","v":1},{"$f":"IF(ISERROR((SUM(B59:M59))/P15),\"\",(SUM(B59:M59))/P15)","v":0.92777777777777792}]
[{"$f":"IF(ISERROR(Q!A4),\"\",Q!A4)","v":"Was COSI Part 1 performed?"},{"$f":"IFERROR(INDEX(April!D:D,MATCH(Year!A:A,April!A:A,0)),\"\")","v":0.6},{"$f":"IFERROR(INDEX(May!D:D,MATCH(Year!A:A,May!A:A,0)),\"\")","v":0.5},{"$f":"IFERROR(INDEX(June!D:D,MATCH(Year!A:A,June!A:A,0)),\"\")","v":0.8},{"$f":"IFERROR(INDEX(July!D:D,MATCH(Year!A:A,July!A:A,0)),\"\")","v":0.8},{"$f":"IFERROR(INDEX(Aug!D:D,MATCH(Year!A:A,Aug!A:A,0)),\"\")","v":1},{"$f":"IFERROR(INDEX(Sept!D:D,MATCH(Year!A:A,Sept!A:A,0)),\"\")","v":0.75},{"$f":"IFERROR(INDEX(Oct!D:D,MATCH(Year!A:A,Oct!A:A,0)),\"\")","v":1},{"$f":"IFERROR(INDEX(Nov!D:D,MATCH(Year!A:A,Nov!A:A,0)),\"\")","v":1},{"$f":"IFERROR(INDEX(Dec!D:D,MATCH(Year!A:A,Dec!A:A,0)),\"\")","v":0.6},{"$f":"IFERROR(INDEX(Jan!D:D,MATCH(Year!A:A,Jan!A:A,0)),\"\")","v":0.83333333333333337},{"$f":"IFERROR(INDEX(Feb!D:D,MATCH(Year!A:A,Feb!A:A,0)),\"\")","v":1},{"$f":"IFERROR(INDEX(March!D:D,MATCH(Year!A:A,March!A:A,0)),\"\")","v":0.66666666666666663},0.79583333333333328]
[{"$f":"IF(ISERROR(Q!A5),\"\",Q!A5)","v":"Was PVP documented?"},{"$f":"IFERROR(INDEX(April!D:D,MATCH(Year!A:A,April!A:A,0)),\"\")","v":1},{"$f":"IFERROR(INDEX(May!D:D,MATCH(Year!A:A,May!A:A,0)),\"\")","v":1},{"$f":"IFERROR(INDEX(June!D:D,MATCH(Year!A:A,June!A:A,0)),\"\")","v":1},{"$f":"IFERROR(INDEX(July!D:D,MATCH(Year!A:A,July!A:A,0)),\"\")","v":1},{"$f":"IFERROR(INDEX(Aug!D:D,MATCH(Year!A:A,Aug!A:A,0)),\"\")","v":1},{"$f":"IFERROR(INDEX(Sept!D:D,MATCH(Year!A:A,Sept!A:A,0)),\"\")","v":1},{"$f":"IFERROR(INDEX(Oct!D:D,MATCH(Year!A:A,Oct!A:A,0)),\"\")","v":1},{"$f":"IFERROR(INDEX(Nov!D:D,MATCH(Year!A:A,Nov!A:A,0)),\"\")","v":1},{"$f":"IFERROR(INDEX(Dec!D:D,MATCH(Year!A:A,Dec!A:A,0)),\"\")","v":1},{"$f":"IFERROR(INDEX(Jan!D:D,MATCH(Year!A:A,Jan!A:A,0)),\"\")","v":1},{"$f":"IFERROR(INDEX(Feb!D:D,MATCH(Year!A:A,Feb!A:A,0)),\"\")","v":1},{"$f":"IFERROR(INDEX(March!D:D,MATCH(Year!A:A,March!A:A,0)),\"\")","v":1},1]
[{"$f":"IF(ISERROR(Q!A6),\"\",Q!A6)","v":"Was Otoscopy documented?"},{"$f":"IFERROR(INDEX(April!D:D,MATCH(Year!A:A,April!A:A,0)),\"\")","v":1},{"$f":"IFERROR(INDEX(May!D:D,MATCH(Year!A:A,May!A:A,0)),\"\")","v":1},{"$f":"IFERROR(INDEX(June!D:D,MATCH(Year!A:A,June!A:A,0)),\"\")","v":1},{"$f":"IFERROR(INDEX(July!D:D,MATCH(Year!A:A,July!A:A,0)),\"\")","v":1},{"$f":"IFERROR(INDEX(Aug!D:D,MATCH(Year!A:A,Aug!A:A,0)),\"\")","v":1},{"$f":"IFERROR(INDEX(Sept!D:D,MATCH(Year!A:A,Sept!A:A,0)),\"\")","v":1},{"$f":"IFERROR(INDEX(Oct!D:D,MATCH(Year!A:A,Oct!A:A,0)),\"\")","v":1},{"$f":"IFERROR(INDEX(Nov!D:D,MATCH(Year!A:A,Nov!A:A,0)),\"\")","v":0.75},{"$f":"IFERROR(INDEX(Dec!D:D,MATCH(Year!A:A,Dec!A:A,0)),\"\")","v":1},{"$f":"IFERROR(INDEX(Jan!D:D,MATCH(Year!A:A,Jan!A:A,0)),\"\")","v":1},{"$f":"IFERROR(INDEX(Feb!D:D,MATCH(Year!A:A,Feb!A:A,0)),\"\")","v":0.8},{"$f":"IFERROR(INDEX(March!D:D,MATCH(Year!A:A,March!A:A,0)),\"\")","v":1},0.96250000000000002]
[{"$f":"IF(ISERROR(Q!A7),\"\",Q!A7)","v":"Document bc at 3 & 4kHz is for programming purposes?"},{"$f":"IFERROR(INDEX(April!D:D,MATCH(Year!A:A,April!A:A,0)),\"\")","v":1},{"$f":"IFERROR(INDEX(May!D:D,MATCH(Year!A:A,May!A:A,0)),\"\")","v":1},{"$f":"IFERROR(INDEX(June!D:D,MATCH(Year!A:A,June!A:A,0)),\"\")","v":1},{"$f":"IFERROR(INDEX(July!D:D,MATCH(Year!A:A,July!A:A,0)),\"\")","v":1},{"$f":"IFERROR(INDEX(Aug!D:D,MATCH(Year!A:A,Aug!A:A,0)),\"\")","v":1},{"$f":"IFERROR(INDEX(Sept!D:D,MATCH(Year!A:A,Sept!A:A,0)),\"\")","v":1},{"$f":"IFERROR(INDEX(Oct!D:D,MATCH(Year!A:A,Oct!A:A,0)),\"\")","v":1},{"$f":"IFERROR(INDEX(Nov!D:D,MATCH(Year!A:A,Nov!A:A,0)),\"\")","v":1},{"$f":"IFERROR(INDEX(Dec!D:D,MATCH(Year!A:A,Dec!A:A,0)),\"\")","v":1},{"$f":"IFERROR(INDEX(Jan!D:D,MATCH(Year!A:A,Jan!A:A,0)),\"\")","v":1},{"$f":"IFERROR(INDEX(Feb!D:D,MATCH(Year!A:A,Feb!A:A,0)),\"\")","v":1},{"$f":"IFERROR(INDEX(March!D:D,MATCH(Year!A:A,March!A:A,0)),\"\")","v":0.66666666666666663},0.97222222222222221]
[{"$f":"IF(ISERROR(Q!A8),\"\",Q!A8)","v":"Was Speech testing performed?"},{"$f":"IFERROR(INDEX(April!D:D,MATCH(Year!A:A,April!A:A,0)),\"\")","v":0.6},{"$f":"IFERROR(INDEX(May!D:D,MATCH(Year!A:A,May!A:A,0)),\"\")","v":0.5},{"$f":"IFERROR(INDEX(June!D:D,MATCH(Year!A:A,June!A:A,0)),\"\")","v":0.8},{"$f":"IFERROR(INDEX(July!D:D,MATCH(Year!A:A,July!A:A,0)),\"\")","v":0.8},{"$f":"IFERROR(INDEX(Aug!D:D,MATCH(Year!A:A,Aug!A:A,0)),\"\")","v":1},{"$f":"IFERROR(INDEX(Sept!D:D,MATCH(Year!A:A,Sept!A:A,0)),\"\")","v":1},{"$f":"IFERROR(INDEX(Oct!D:D,MATCH(Year!A:A,Oct!A:A,0)),\"\")","v":1},{"$f":"IFERROR(INDEX(Nov!D:D,MATCH(Year!A:A,Nov!A:A,0)),\"\")","v":0.5},{"$f":"IFERROR(INDEX(Dec!D:D,MATCH(Year!A:A,Dec!A:A,0)),\"\")","v":1},{"$f":"IFERROR(INDEX(Jan!D:D,MATCH(Year!A:A,Jan!A:A,0)),\"\")","v":1},{"$f":"IFERROR(INDEX(Feb!D:D,MATCH(Year!A:A,Feb!A:A,0)),\"\")","v":1},{"$f":"IFERROR(INDEX(March!D:D,MATCH(Year!A:A,March!A:A,0)),\"\")","v":0.66666666666666663},0.82222222222222208]
[{"$f":"IF(ISERROR(Q!A9),\"\",Q!A9)","v":"Is it documented whether national criteria were/were not met?"},{"$f":"IFERROR(INDEX(April!D:D,MATCH(Year!A:A,April!A:A,0)),\"\")","v":0.8},{"$f":"IFERROR(INDEX(May!D:D,MATCH(Year!A:A,May!A:A,0)),\"\")","v":1},{"$f":"IFERROR(INDEX(June!D:D,MATCH(Year!A:A,June!A:A,0)),\"\")","v":1},{"$f":"IFERROR(INDEX(July!D:D,MATCH(Year!A:A,July!A:A,0)),\"\")","v":1},{"$f":"IFERROR(INDEX(Aug!D:D,MATCH(Year!A:A,Aug!A:A,0)),\"\")","v":1},{"$f":"IFERROR(INDEX(Sept!D:D,MATCH(Year!A:A,Sept!A:A,0)),\"\")","v":1},{"$f":"IFERROR(INDEX(Oct!D:D,MATCH(Year!A:A,Oct!A:A,0)),\"\")","v":1},{"$f":"IFERROR(INDEX(Nov!D:D,MATCH(Year!A:A,Nov!A:A,0)),\"\")","v":0.75},{"$f":"IFERROR(INDEX(Dec!D:D,MATCH(Year!A:A,Dec!A:A,0)),\"\")","v":1},{"$f":"IFERROR(INDEX(Jan!D:D,MATCH(Year!A:A,Jan!A:A,0)),\"\")","v":1},{"$f":"IFERROR(INDEX(Feb!D:D,MATCH(Year!A:A,Feb!A:A,0)),\"\")","v":1},{"$f":"IFERROR(INDEX(March!D:D,MATCH(Year!A:A,March!A:A,0)),\"\")","v":1},0.96250000000000002]
[{"$f":"IF(ISERROR(Q!A10),\"\",Q!A10)","v":"Was a BCHI info pack supplied?"},{"$f":"IFERROR(INDEX(April!D:D,MATCH(Year!A:A,April!A:A,0)),\"\")","v":0.6},{"$f":"IFERROR(INDEX(May!D:D,MATCH(Year!A:A,May!A:A,0)),\"\")","v":1},{"$f":"IFERROR(INDEX(June!D:D,MATCH(Year!A:A,June!A:A,0)),\"\")","v":0.8},{"$f":"IFERROR(INDEX(July!D:D,MATCH(Year!A:A,July!A:A,0)),\"\")","v":1},{"$f":"IFERROR(INDEX(Aug!D:D,MATCH(Year!A:A,Aug!A:A,0)),\"\")","v":0.8},{"$f":"IFERROR(INDEX(Sept!D:D,MATCH(Year!A:A,Sept!A:A,0)),\"\")","v":1},{"$f":"IFERROR(INDEX(Oct!D:D,MATCH(Year!A:A,Oct!A:A,0)),\"\")","v":0.66666666666666663},{"$f":"IFERROR(INDEX(Nov!D:D,MATCH(Year!A:A,Nov!A:A,0)),\"\")","v":0.5},{"$f":"IFERROR(INDEX(Dec!D:D,MATCH(Year!A:A,Dec!A:A,0)),\"\")","v":1},{"$f":"IFERROR(INDEX(Jan!D:D,MATCH(Year!A:A,Jan!A:A,0)),\"\")","v":1},{"$f":"IFERROR(INDEX(Feb!D:D,MATCH(Year!A:A,Feb!A:A,0)),\"\")","v":1},{"$f":"IFERROR(INDEX(March!D:D,MATCH(Year!A:A,March!A:A,0)),\"\")","v":0.66666666666666663},0.83611111111111114]
[{"$f":"IF(ISERROR(Q!A11),\"\",Q!A11)","v":"Was the report authorised & issued within target (7 days)?"},{"$f":"IFERROR(INDEX(April!D:D,MATCH(Year!A:A,April!A:A,0)),\"\")","v":1},{"$f":"IFERROR(INDEX(May!D:D,MATCH(Year!A:A,May!A:A,0)),\"\")","v":1},{"$f":"IFERROR(INDEX(June!D:D,MATCH(Year!A:A,June!A:A,0)),\"\")","v":1},{"$f":"IFERROR(INDEX(July!D:D,MATCH(Year!A:A,July!A:A,0)),\"\")","v":1},{"$f":"IFERROR(INDEX(Aug!D:D,MATCH(Year!A:A,Aug!A:A,0)),\"\")","v":1},{"$f":"IFERROR(INDEX(Sept!D:D,MATCH(Year!A:A,Sept!A:A,0)),\"\")","v":1},{"$f":"IFERROR(INDEX(Oct!D:D,MATCH(Year!A:A,Oct!A:A,0)),\"\")","v":1},{"$f":"IFERROR(INDEX(Nov!D:D,MATCH(Year!A:A,Nov!A:A,0)),\"\")","v":1},{"$f":"IFERROR(INDEX(Dec!D:D,MATCH(Year!A:A,Dec!A:A,0)),\"\")","v":1},{"$f":"IFERROR(INDEX(Jan!D:D,MATCH(Year!A:A,Jan!A:A,0)),\"\")","v":1},{"$f":"IFERROR(INDEX(Feb!D:D,MATCH(Year!A:A,Feb!A:A,0)),\"\")","v":1},{"$f":"IFERROR(INDEX(March!D:D,MATCH(Year!A:A,March!A:A,0)),\"\")","v":1},1]
[{"$f":"IF(ISERROR(Q!A12),\"\",Q!A12)","v":"Was consent documented as appropriate?"},{"$f":"IFERROR(INDEX(April!D:D,MATCH(Year!A:A,April!A:A,0)),\"\")","v":1},{"$f":"IFERROR(INDEX(May!D:D,MATCH(Year!A:A,May!A:A,0)),\"\")","v":1},{"$f":"IFERROR(INDEX(June!D:D,MATCH(Year!A:A,June!A:A,0)),\"\")","v":1},{"$f":"IFERROR(INDEX(July!D:D,MATCH(Year!A:A,July!A:A,0)),\"\")","v":1},{"$f":"IFERROR(INDEX(Aug!D:D,MATCH(Year!A:A,Aug!A:A,0)),\"\")","v":1},{"$f":"IFERROR(INDEX(Sept!D:D,MATCH(Year!A:A,Sept!A:A,0)),\"\")","v":1},{"$f":"IFERROR(INDEX(Oct!D:D,MATCH(Year!A:A,Oct!A:A,0)),\"\")","v":1},{"$f":"IFERROR(INDEX(Nov!D:D,MATCH(Year!A:A,Nov!A:A,0)),\"\")","v":1},{"$f":"IFERROR(INDEX(Dec!D:D,MATCH(Year!A:A,Dec!A:A,0)),\"\")","v":1},{"$f":"IFERROR(INDEX(Jan!D:D,MATCH(Year!A:A,Jan!A:A,0)),\"\")","v":1},{"$f":"IFERROR(INDEX(Feb!D:D,MATCH(Year!A:A,Feb!A:A,0)),\"\")","v":1},{"$f":"IFERROR(INDEX(March!D:D,MATCH(Year!A:A,March!A:A,0)),\"\")","v":1},1]
[{"$f":"IF(ISERROR(Q!A13),\"\",Q!A13)","v":0},{"$f":"IFERROR(INDEX(April!D:D,MATCH(Year!A:A,April!A:A,0)),\"\")","v":""},{"$f":"IFERROR(INDEX(May!D:D,MATCH(Year!A:A,May!A:A,0)),\"\")","v":""},{"$f":"IFERROR(INDEX(June!D:D,MATCH(Year!A:A,June!A:A,0)),\"\")","v":""},{"$f":"IFERROR(INDEX(July!D:D,MATCH(Year!A:A,July!A:A,0)),\"\")","v":""},{"$f":"IFERROR(INDEX(Aug!D:D,MATCH(Year!A:A,Aug!A:A,0)),\"\")","v":""},{"$f":"IFERROR(INDEX(Sept!D:D,MATCH(Year!A:A,Sept!A:A,0)),\"\")","v":""},{"$f":"IFERROR(INDEX(Oct!D:D,MATCH(Year!A:A,Oct!A:A,0)),\"\")","v":""},{"$f":"IFERROR(INDEX(Nov!D:D,MATCH(Year!A:A,Nov!A:A,0)),\"\")","v":""},{"$f":"IFERROR(INDEX(Dec!D:D,MATCH(Year!A:A,Dec!A:A,0)),\"\")","v":""},{"$f":"IFERROR(INDEX(Jan!D:D,MATCH(Year!A:A,Jan!A:A,0)),\"\")","v":""},{"$f":"IFERROR(INDEX(Feb!D:D,MATCH(Year!A:A,Feb!A:A,0)),\"\")","v":""},{"$f":"IFERROR(INDEX(March!D:D,MATCH(Year!A:A,March!A:A,0)),\"\")","v":""},""]
[{"$f":"IF(ISERROR(Q!A14),\"\",Q!A14)","v":0},{"$f":"IFERROR(INDEX(April!D:D,MATCH(Year!A:A,April!A:A,0)),\"\")","v":""},{"$f":"IFERROR(INDEX(May!D:D,MATCH(Year!A:A,May!A:A,0)),\"\")","v":""},{"$f":"IFERROR(INDEX(June!D:D,MATCH(Year!A:A,June!A:A,0)),\"\")","v":""},{"$f":"IFERROR(INDEX(July!D:D,MATCH(Year!A:A,July!A:A,0)),\"\")","v":""},{"$f":"IFERROR(INDEX(Aug!D:D,MATCH(Year!A:A,Aug!A:A,0)),\"\")","v":""},{"$f":"IFERROR(INDEX(Sept!D:D,MATCH(Year!A:A,Sept!A:A,0)),\"\")","v":""},{"$f":"IFERROR(INDEX(Oct!D:D,MATCH(Year!A:A,Oct!A:A,0)),\"\")","v":""},{"$f":"IFERROR(INDEX(Nov!D:D,MATCH(Year!A:A,Nov!A:A,0)),\"\")","v":""},{"$f":"IFERROR(INDEX(Dec!D:D,MATCH(Year!A:A,Dec!A:A,0)),\"\")","v":""},{"$f":"IFERROR(INDEX(Jan!D:D,MATCH(Year!A:A,Jan!A:A,0)),\"\")","v":""},{"$f":"IFERROR(INDEX(Feb!D:D,MATCH(Year!A:A,Feb!A:A,0)),\"\")","v":""},{"$f":"IFERROR(INDEX(March!D:D,MATCH(Year!A:A,March!A:A,0)),\"\")","v":""},""]
[{"$f":"IF(ISERROR(Q!A15),\"\",Q!A15)","v":0},{"$f":"IFERROR(INDEX(April!D:D,MATCH(Year!A:A,April!A:A,0)),\"\")","v":""},{"$f":"IFERROR(INDEX(May!D:D,MATCH(Year!A:A,May!A:A,0)),\"\")","v":""},{"$f":"IFERROR(INDEX(June!D:D,MATCH(Year!A:A,June!A:A,0)),\"\")","v":""},{"$f":"IFERROR(INDEX(July!D:D,MATCH(Year!A:A,July!A:A,0)),\"\")","v":""},{"$f":"IFERROR(INDEX(Aug!D:D,MATCH(Year!A:A,Aug!A:A,0)),\"\")","v":""},{"$f":"IFERROR(INDEX(Sept!D:D,MATCH(Year!A:A,Sept!A:A,0)),\"\")","v":""},{"$f":"IFERROR(INDEX(Oct!D:D,MATCH(Year!A:A,Oct!A:A,0)),\"\")","v":""},{"$f":"IFERROR(INDEX(Nov!D:D,MATCH(Year!A:A,Nov!A:A,0)),\"\")","v":""},{"$f":"IFERROR(INDEX(Dec!D:D,MATCH(Year!A:A,Dec!A:A,0)),\"\")","v":""},{"$f":"IFERROR(INDEX(Jan!D:D,MATCH(Year!A:A,Jan!A:A,0)),\"\")","v":""},{"$f":"IFERROR(INDEX(Feb!D:D,MATCH(Year!A:A,Feb!A:A,0)),\"\")","v":""},{"$f":"IFERROR(INDEX(March!D:D,MATCH(Year!A:A,March!A:A,0)),\"\")","v":""},""]
[{"$f":"IF(ISERROR(Q!A16),\"\",Q!A16)","v":0},{"$f":"IFERROR(INDEX(April!D:D,MATCH(Year!A:A,April!A:A,0)),\"\")","v":""},{"$f":"IFERROR(INDEX(May!D:D,MATCH(Year!A:A,May!A:A,0)),\"\")","v":""},{"$f":"IFERROR(INDEX(June!D:D,MATCH(Year!A:A,June!A:A,0)),\"\")","v":""},{"$f":"IFERROR(INDEX(July!D:D,MATCH(Year!A:A,July!A:A,0)),\"\")","v":""},{"$f":"IFERROR(INDEX(Aug!D:D,MATCH(Year!A:A,Aug!A:A,0)),\"\")","v":""},{"$f":"IFERROR(INDEX(Sept!D:D,MATCH(Year!A:A,Sept!A:A,0)),\"\")","v":""},{"$f":"IFERROR(INDEX(Oct!D:D,MATCH(Year!A:A,Oct!A:A,0)),\"\")","v":""},{"$f":"IFERROR(INDEX(Nov!D:D,MATCH(Year!A:A,Nov!A:A,0)),\"\")","v":""},{"$f":"IFERROR(INDEX(Dec!D:D,MATCH(Year!A:A,Dec!A:A,0)),\"\")","v":""},{"$f":"IFERROR(INDEX(Jan!D:D,MATCH(Year!A:A,Jan!A:A,0)),\"\")","v":""},{"$f":"IFERROR(INDEX(Feb!D:D,MATCH(Year!A:A,Feb!A:A,0)),\"\")","v":""},{"$f":"IFERROR(INDEX(March!D:D,MATCH(Year!A:A,March!A:A,0)),\"\")","v":""},""]
[{"$f":"IF(ISERROR(Q!A17),\"\",Q!A17)","v":0},{"$f":"IFERROR(INDEX(April!D:D,MATCH(Year!A:A,April!A:A,0)),\"\")","v":""},{"$f":"IFERROR(INDEX(May!D:D,MATCH(Year!A:A,May!A:A,0)),\"\")","v":""},{"$f":"IFERROR(INDEX(June!D:D,MATCH(Year!A:A,June!A:A,0)),\"\")","v":""},{"$f":"IFERROR(INDEX(July!D:D,MATCH(Year!A:A,July!A:A,0)),\"\")","v":""},{"$f":"IFERROR(INDEX(Aug!D:D,MATCH(Year!A:A,Aug!A:A,0)),\"\")","v":""},{"$f":"IFERROR(INDEX(Sept!D:D,MATCH(Year!A:A,Sept!A:A,0)),\"\")","v":""},{"$f":"IFERROR(INDEX(Oct!D:D,MATCH(Year!A:A,Oct!A:A,0)),\"\")","v":""},{"$f":"IFERROR(INDEX(Nov!D:D,MATCH(Year!A:A,Nov!A:A,0)),\"\")","v":""},{"$f":"IFERROR(INDEX(Dec!D:D,MATCH(Year!A:A,Dec!A:A,0)),\"\")","v":""},{"$f":"IFERROR(INDEX(Jan!D:D,MATCH(Year!A:A,Jan!A:A,0)),\"\")","v":""},{"$f":"IFERROR(INDEX(Feb!D:D,MATCH(Year!A:A,Feb!A:A,0)),\"\")","v":""},{"$f":"IFERROR(INDEX(March!D:D,MATCH(Year!A:A,March!A:A,0)),\"\")","v":""},""]
[{"$f":"IF(ISERROR(Q!A18),\"\",Q!A18)","v":0},{"$f":"IFERROR(INDEX(April!D:D,MATCH(Year!A:A,April!A:A,0)),\"\")","v":""},{"$f":"IFERROR(INDEX(May!D:D,MATCH(Year!A:A,May!A:A,0)),\"\")","v":""},{"$f":"IFERROR(INDEX(June!D:D,MATCH(Year!A:A,June!A:A,0)),\"\")","v":""},{"$f":"IFERROR(INDEX(July!D:D,MATCH(Year!A:A,July!A:A,0)),\"\")","v":""},{"$f":"IFERROR(INDEX(Aug!D:D,MATCH(Year!A:A,Aug!A:A,0)),\"\")","v":""},{"$f":"IFERROR(INDEX(Sept!D:D,MATCH(Year!A:A,Sept!A:A,0)),\"\")","v":""},{"$f":"IFERROR(INDEX(Oct!D:D,MATCH(Year!A:A,Oct!A:A,0)),\"\")","v":""},{"$f":"IFERROR(INDEX(Nov!D:D,MATCH(Year!A:A,Nov!A:A,0)),\"\")","v":""},{"$f":"IFERROR(INDEX(Dec!D:D,MATCH(Year!A:A,Dec!A:A,0)),\"\")","v":""},{"$f":"IFERROR(INDEX(Jan!D:D,MATCH(Year!A:A,Jan!A:A,0)),\"\")","v":""},{"$f":"IFERROR(INDEX(Feb!D:D,MATCH(Year!A:A,Feb!A:A,0)),\"\")","v":""},{"$f":"IFERROR(INDEX(March!D:D,MATCH(Year!A:A,March!A:A,0)),\"\")","v":""},""]
[{"$f":"IF(ISERROR(Q!A19),\"\",Q!A19)","v":0},{"$f":"IFERROR(INDEX(April!D:D,MATCH(Year!A:A,April!A:A,0)),\"\")","v":""},{"$f":"IFERROR(INDEX(May!D:D,MATCH(Year!A:A,May!A:A,0)),\"\")","v":""},{"$f":"IFERROR(INDEX(June!D:D,MATCH(Year!A:A,June!A:A,0)),\"\")","v":""},{"$f":"IFERROR(INDEX(July!D:D,MATCH(Year!A:A,July!A:A,0)),\"\")","v":""},{"$f":"IFERROR(INDEX(Aug!D:D,MATCH(Year!A:A,Aug!A:A,0)),\"\")","v":""},{"$f":"IFERROR(INDEX(Sept!D:D,MATCH(Year!A:A,Sept!A:A,0)),\"\")","v":""},{"$f":"IFERROR(INDEX(Oct!D:D,MATCH(Year!A:A,Oct!A:A,0)),\"\")","v":""},{"$f":"IFERROR(INDEX(Nov!D:D,MATCH(Year!A:A,Nov!A:A,0)),\"\")","v":""},{"$f":"IFERROR(INDEX(Dec!D:D,MATCH(Year!A:A,Dec!A:A,0)),\"\")","v":""},{"$f":"IFERROR(INDEX(Jan!D:D,MATCH(Year!A:A,Jan!A:A,0)),\"\")","v":""},{"$f":"IFERROR(INDEX(Feb!D:D,MATCH(Year!A:A,Feb!A:A,0)),\"\")","v":""},{"$f":"IFERROR(INDEX(March!D:D,MATCH(Year!A:A,March!A:A,0)),\"\")","v":""},""]
[{"$f":"IF(ISERROR(Q!A20),\"\",Q!A20)","v":0},{"$f":"IFERROR(INDEX(April!D:D,MATCH(Year!A:A,April!A:A,0)),\"\")","v":""},{"$f":"IFERROR(INDEX(May!D:D,MATCH(Year!A:A,May!A:A,0)),\"\")","v":""},{"$f":"IFERROR(INDEX(June!D:D,MATCH(Year!A:A,June!A:A,0)),\"\")","v":""},{"$f":"IFERROR(INDEX(July!D:D,MATCH(Year!A:A,July!A:A,0)),\"\")","v":""},{"$f":"IFERROR(INDEX(Aug!D:D,MATCH(Year!A:A,Aug!A:A,0)),\"\")","v":""},{"$f":"IFERROR(INDEX(Sept!D:D,MATCH(Year!A:A,Sept!A:A,0)),\"\")","v":""},{"$f":"IFERROR(INDEX(Oct!D:D,MATCH(Year!A:A,Oct!A:A,0)),\"\")","v":""},{"$f":"IFERROR(INDEX(Nov!D:D,MATCH(Year!A:A,Nov!A:A,0)),\"\")","v":""},{"$f":"IFERROR(INDEX(Dec!D:D,MATCH(Year!A:A,Dec!A:A,0)),\"\")","v":""},{"$f":"IFERROR(INDEX(Jan!D:D,MATCH(Year!A:A,Jan!A:A,0)),\"\")","v":""},{"$f":"IFERROR(INDEX(Feb!D:D,MATCH(Year!A:A,Feb!A:A,0)),\"\")","v":""},{"$f":"IFERROR(INDEX(March!D:D,MATCH(Year!A:A,March!A:A,0)),\"\")","v":""},""]
[{"$f":"IF(ISERROR(Q!A21),\"\",Q!A21)","v":0},{"$f":"IFERROR(INDEX(April!D:D,MATCH(Year!A:A,April!A:A,0)),\"\")","v":""},{"$f":"IFERROR(INDEX(May!D:D,MATCH(Year!A:A,May!A:A,0)),\"\")","v":""},{"$f":"IFERROR(INDEX(June!D:D,MATCH(Year!A:A,June!A:A,0)),\"\")","v":""},{"$f":"IFERROR(INDEX(July!D:D,MATCH(Year!A:A,July!A:A,0)),\"\")","v":""},{"$f":"IFERROR(INDEX(Aug!D:D,MATCH(Year!A:A,Aug!A:A,0)),\"\")","v":""},{"$f":"IFERROR(INDEX(Sept!D:D,MATCH(Year!A:A,Sept!A:A,0)),\"\")","v":""},{"$f":"IFERROR(INDEX(Oct!D:D,MATCH(Year!A:A,Oct!A:A,0)),\"\")","v":""},{"$f":"IFERROR(INDEX(Nov!D:D,MATCH(Year!A:A,Nov!A:A,0)),\"\")","v":""},{"$f":"IFERROR(INDEX(Dec!D:D,MATCH(Year!A:A,Dec!A:A,0)),\"\")","v":""},{"$f":"IFERROR(INDEX(Jan!D:D,MATCH(Year!A:A,Jan!A:A,0)),\"\")","v":""},{"$f":"IFERROR(INDEX(Feb!D:D,MATCH(Year!A:A,Feb!A:A,0)),\"\")","v":""},{"$f":"IFERROR(INDEX(March!D:D,MATCH(Year!A:A,March!A:A,0)),\"\")","v":""},""]
[{"$f":"IF(ISERROR(Q!A22),\"\",Q!A22)","v":0},{"$f":"IFERROR(INDEX(April!D:D,MATCH(Year!A:A,April!A:A,0)),\"\")","v":""},{"$f":"IFERROR(INDEX(May!D:D,MATCH(Year!A:A,May!A:A,0)),\"\")","v":""},{"$f":"IFERROR(INDEX(June!D:D,MATCH(Year!A:A,June!A:A,0)),\"\")","v":""},{"$f":"IFERROR(INDEX(July!D:D,MATCH(Year!A:A,July!A:A,0)),\"\")","v":""},{"$f":"IFERROR(INDEX(Aug!D:D,MATCH(Year!A:A,Aug!A:A,0)),\"\")","v":""},{"$f":"IFERROR(INDEX(Sept!D:D,MATCH(Year!A:A,Sept!A:A,0)),\"\")","v":""},{"$f":"IFERROR(INDEX(Oct!D:D,MATCH(Year!A:A,Oct!A:A,0)),\"\")","v":""},{"$f":"IFERROR(INDEX(Nov!D:D,MATCH(Year!A:A,Nov!A:A,0)),\"\")","v":""},{"$f":"IFERROR(INDEX(Dec!D:D,MATCH(Year!A:A,Dec!A:A,0)),\"\")","v":""},{"$f":"IFERROR(INDEX(Jan!D:D,MATCH(Year!A:A,Jan!A:A,0)),\"\")","v":""},{"$f":"IFERROR(INDEX(Feb!D:D,MATCH(Year!A:A,Feb!A:A,0)),\"\")","v":""},{"$f":"IFERROR(INDEX(March!D:D,MATCH(Year!A:A,March!A:A,0)),\"\")","v":""},""]
[{"$f":"IF(ISERROR(Q!A23),\"\",Q!A23)","v":0},{"$f":"IFERROR(INDEX(April!D:D,MATCH(Year!A:A,April!A:A,0)),\"\")","v":""},{"$f":"IFERROR(INDEX(May!D:D,MATCH(Year!A:A,May!A:A,0)),\"\")","v":""},{"$f":"IFERROR(INDEX(June!D:D,MATCH(Year!A:A,June!A:A,0)),\"\")","v":""},{"$f":"IFERROR(INDEX(July!D:D,MATCH(Year!A:A,July!A:A,0)),\"\")","v":""},{"$f":"IFERROR(INDEX(Aug!D:D,MATCH(Year!A:A,Aug!A:A,0)),\"\")","v":""},{"$f":"IFERROR(INDEX(Sept!D:D,MATCH(Year!A:A,Sept!A:A,0)),\"\")","v":""},{"$f":"IFERROR(INDEX(Oct!D:D,MATCH(Year!A:A,Oct!A:A,0)),\"\")","v":""},{"$f":"IFERROR(INDEX(Nov!D:D,MATCH(Year!A:A,Nov!A:A,0)),\"\")","v":""},{"$f":"IFERROR(INDEX(Dec!D:D,MATCH(Year!A:A,Dec!A:A,0)),\"\")","v":""},{"$f":"IFERROR(INDEX(Jan!D:D,MATCH(Year!A:A,Jan!A:A,0)),\"\")","v":""},{"$f":"IFERROR(INDEX(Feb!D:D,MATCH(Year!A:A,Feb!A:A,0)),\"\")","v":""},{"$f":"IFERROR(INDEX(March!D:D,MATCH(Year!A:A,March!A:A,0)),\"\")","v":""},""]
[{"$f":"IF(ISERROR(Q!A24),\"\",Q!A24)","v":0},{"$f":"IFERROR(INDEX(April!D:D,MATCH(Year!A:A,April!A:A,0)),\"\")","v":""},{"$f":"IFERROR(INDEX(May!D:D,MATCH(Year!A:A,May!A:A,0)),\"\")","v":""},{"$f":"IFERROR(INDEX(June!D:D,MATCH(Year!A:A,June!A:A,0)),\"\")","v":""},{"$f":"IFERROR(INDEX(July!D:D,MATCH(Year!A:A,July!A:A,0)),\"\")","v":""},{"$f":"IFERROR(INDEX(Aug!D:D,MATCH(Year!A:A,Aug!A:A,0)),\"\")","v":""},{"$f":"IFERROR(INDEX(Sept!D:D,MATCH(Year!A:A,Sept!A:A,0)),\"\")","v":""},{"$f":"IFERROR(INDEX(Oct!D:D,MATCH(Year!A:A,Oct!A:A,0)),\"\")","v":""},{"$f":"IFERROR(INDEX(Nov!D:D,MATCH(Year!A:A,Nov!A:A,0)),\"\")","v":""},{"$f":"IFERROR(INDEX(Dec!D:D,MATCH(Year!A:A,Dec!A:A,0)),\"\")","v":""},{"$f":"IFERROR(INDEX(Jan!D:D,MATCH(Year!A:A,Jan!A:A,0)),\"\")","v":""},{"$f":"IFERROR(INDEX(Feb!D:D,MATCH(Year!A:A,Feb!A:A,0)),\"\")","v":""},{"$f":"IFERROR(INDEX(March!D:D,MATCH(Year!A:A,March!A:A,0)),\"\")","v":""},""]
[{"$f":"IF(ISERROR(Q!A25),\"\",Q!A25)","v":0},{"$f":"IFERROR(INDEX(April!D:D,MATCH(Year!A:A,April!A:A,0)),\"\")","v":""},{"$f":"IFERROR(INDEX(May!D:D,MATCH(Year!A:A,May!A:A,0)),\"\")","v":""},{"$f":"IFERROR(INDEX(June!D:D,MATCH(Year!A:A,June!A:A,0)),\"\")","v":""},{"$f":"IFERROR(INDEX(July!D:D,MATCH(Year!A:A,July!A:A,0)),\"\")","v":""},{"$f":"IFERROR(INDEX(Aug!D:D,MATCH(Year!A:A,Aug!A:A,0)),\"\")","v":""},{"$f":"IFERROR(INDEX(Sept!D:D,MATCH(Year!A:A,Sept!A:A,0)),\"\")","v":""},{"$f":"IFERROR(INDEX(Oct!D:D,MATCH(Year!A:A,Oct!A:A,0)),\"\")","v":""},{"$f":"IFERROR(INDEX(Nov!D:D,MATCH(Year!A:A,Nov!A:A,0)),\"\")","v":""},{"$f":"IFERROR(INDEX(Dec!D:D,MATCH(Year!A:A,Dec!A:A,0)),\"\")","v":""},{"$f":"IFERROR(INDEX(Jan!D:D,MATCH(Year!A:A,Jan!A:A,0)),\"\")","v":""},{"$f":"IFERROR(INDEX(Feb!D:D,MATCH(Year!A:A,Feb!A:A,0)),\"\")","v":""},{"$f":"IFERROR(INDEX(March!D:D,MATCH(Year!A:A,March!A:A,0)),\"\")","v":""},""]
[{"$f":"IF(ISERROR(Q!A26),\"\",Q!A26)","v":0},{"$f":"IFERROR(INDEX(April!D:D,MATCH(Year!A:A,April!A:A,0)),\"\")","v":""},{"$f":"IFERROR(INDEX(May!D:D,MATCH(Year!A:A,May!A:A,0)),\"\")","v":""},{"$f":"IFERROR(INDEX(June!D:D,MATCH(Year!A:A,June!A:A,0)),\"\")","v":""},{"$f":"IFERROR(INDEX(July!D:D,MATCH(Year!A:A,July!A:A,0)),\"\")","v":""},{"$f":"IFERROR(INDEX(Aug!D:D,MATCH(Year!A:A,Aug!A:A,0)),\"\")","v":""},{"$f":"IFERROR(INDEX(Sept!D:D,MATCH(Year!A:A,Sept!A:A,0)),\"\")","v":""},{"$f":"IFERROR(INDEX(Oct!D:D,MATCH(Year!A:A,Oct!A:A,0)),\"\")","v":""},{"$f":"IFERROR(INDEX(Nov!D:D,MATCH(Year!A:A,Nov!A:A,0)),\"\")","v":""},{"$f":"IFERROR(INDEX(Dec!D:D,MATCH(Year!A:A,Dec!A:A,0)),\"\")","v":""},{"$f":"IFERROR(INDEX(Jan!D:D,MATCH(Year!A:A,Jan!A:A,0)),\"\")","v":""},{"$f":"IFERROR(INDEX(Feb!D:D,MATCH(Year!A:A,Feb!A:A,0)),\"\")","v":""},{"$f":"IFERROR(INDEX(March!D:D,MATCH(Year!A:A,March!A:A,0)),\"\")","v":""},""]
[{"$f":"IF(ISERROR(Q!A27),\"\",Q!A27)","v":0},{"$f":"IFERROR(INDEX(April!D:D,MATCH(Year!A:A,April!A:A,0)),\"\")","v":""},{"$f":"IFERROR(INDEX(May!D:D,MATCH(Year!A:A,May!A:A,0)),\"\")","v":""},{"$f":"IFERROR(INDEX(June!D:D,MATCH(Year!A:A,June!A:A,0)),\"\")","v":""},{"$f":"IFERROR(INDEX(July!D:D,MATCH(Year!A:A,July!A:A,0)),\"\")","v":""},{"$f":"IFERROR(INDEX(Aug!D:D,MATCH(Year!A:A,Aug!A:A,0)),\"\")","v":""},{"$f":"IFERROR(INDEX(Sept!D:D,MATCH(Year!A:A,Sept!A:A,0)),\"\")","v":""},{"$f":"IFERROR(INDEX(Oct!D:D,MATCH(Year!A:A,Oct!A:A,0)),\"\")","v":""},{"$f":"IFERROR(INDEX(Nov!D:D,MATCH(Year!A:A,Nov!A:A,0)),\"\")","v":""},{"$f":"IFERROR(INDEX(Dec!D:D,MATCH(Year!A:A,Dec!A:A,0)),\"\")","v":""},{"$f":"IFERROR(INDEX(Jan!D:D,MATCH(Year!A:A,Jan!A:A,0)),\"\")","v":""},{"$f":"IFERROR(INDEX(Feb!D:D,MATCH(Year!A:A,Feb!A:A,0)),\"\")","v":""},{"$f":"IFERROR(INDEX(March!D:D,MATCH(Year!A:A,March!A:A,0)),\"\")","v":""},""]
[{"$f":"IF(ISERROR(Q!A28),\"\",Q!A28)","v":0},{"$f":"IFERROR(INDEX(April!D:D,MATCH(Year!A:A,April!A:A,0)),\"\")","v":""},{"$f":"IFERROR(INDEX(May!D:D,MATCH(Year!A:A,May!A:A,0)),\"\")","v":""},{"$f":"IFERROR(INDEX(June!D:D,MATCH(Year!A:A,June!A:A,0)),\"\")","v":""},{"$f":"IFERROR(INDEX(July!D:D,MATCH(Year!A:A,July!A:A,0)),\"\")","v":""},{"$f":"IFERROR(INDEX(Aug!D:D,MATCH(Year!A:A,Aug!A:A,0)),\"\")","v":""},{"$f":"IFERROR(INDEX(Sept!D:D,MATCH(Year!A:A,Sept!A:A,0)),\"\")","v":""},{"$f":"IFERROR(INDEX(Oct!D:D,MATCH(Year!A:A,Oct!A:A,0)),\"\")","v":""},{"$f":"IFERROR(INDEX(Nov!D:D,MATCH(Year!A:A,Nov!A:A,0)),\"\")","v":""},{"$f":"IFERROR(INDEX(Dec!D:D,MATCH(Year!A:A,Dec!A:A,0)),\"\")","v":""},{"$f":"IFERROR(INDEX(Jan!D:D,MATCH(Year!A:A,Jan!A:A,0)),\"\")","v":""},{"$f":"IFERROR(INDEX(Feb!D:D,MATCH(Year!A:A,Feb!A:A,0)),\"\")","v":""},{"$f":"IFERROR(INDEX(March!D:D,MATCH(Year!A:A,March!A:A,0)),\"\")","v":""},""]
[{"$f":"IF(ISERROR(Q!A29),\"\",Q!A29)","v":0},{"$f":"IFERROR(INDEX(April!D:D,MATCH(Year!A:A,April!A:A,0)),\"\")","v":""},{"$f":"IFERROR(INDEX(May!D:D,MATCH(Year!A:A,May!A:A,0)),\"\")","v":""},{"$f":"IFERROR(INDEX(June!D:D,MATCH(Year!A:A,June!A:A,0)),\"\")","v":""},{"$f":"IFERROR(INDEX(July!D:D,MATCH(Year!A:A,July!A:A,0)),\"\")","v":""},{"$f":"IFERROR(INDEX(Aug!D:D,MATCH(Year!A:A,Aug!A:A,0)),\"\")","v":""},{"$f":"IFERROR(INDEX(Sept!D:D,MATCH(Year!A:A,Sept!A:A,0)),\"\")","v":""},{"$f":"IFERROR(INDEX(Oct!D:D,MATCH(Year!A:A,Oct!A:A,0)),\"\")","v":""},{"$f":"IFERROR(INDEX(Nov!D:D,MATCH(Year!A:A,Nov!A:A,0)),\"\")","v":""},{"$f":"IFERROR(INDEX(Dec!D:D,MATCH(Year!A:A,Dec!A:A,0)),\"\")","v":""},{"$f":"IFERROR(INDEX(Jan!D:D,MATCH(Year!A:A,Jan!A:A,0)),\"\")","v":""},{"$f":"IFERROR(INDEX(Feb!D:D,MATCH(Year!A:A,Feb!A:A,0)),\"\")","v":""},{"$f":"IFERROR(INDEX(March!D:D,MATCH(Year!A:A,March!A:A,0)),\"\")","v":""},""]
[{"$f":"IF(ISERROR(Q!A30),\"\",Q!A30)","v":0},{"$f":"IFERROR(INDEX(April!D:D,MATCH(Year!A:A,April!A:A,0)),\"\")","v":""},{"$f":"IFERROR(INDEX(May!D:D,MATCH(Year!A:A,May!A:A,0)),\"\")","v":""},{"$f":"IFERROR(INDEX(June!D:D,MATCH(Year!A:A,June!A:A,0)),\"\")","v":""},{"$f":"IFERROR(INDEX(July!D:D,MATCH(Year!A:A,July!A:A,0)),\"\")","v":""},{"$f":"IFERROR(INDEX(Aug!D:D,MATCH(Year!A:A,Aug!A:A,0)),\"\")","v":""},{"$f":"IFERROR(INDEX(Sept!D:D,MATCH(Year!A:A,Sept!A:A,0)),\"\")","v":""},{"$f":"IFERROR(INDEX(Oct!D:D,MATCH(Year!A:A,Oct!A:A,0)),\"\")","v":""},{"$f":"IFERROR(INDEX(Nov!D:D,MATCH(Year!A:A,Nov!A:A,0)),\"\")","v":""},{"$f":"IFERROR(INDEX(Dec!D:D,MATCH(Year!A:A,Dec!A:A,0)),\"\")","v":""},{"$f":"IFERROR(INDEX(Jan!D:D,MATCH(Year!A:A,Jan!A:A,0)),\"\")","v":""},{"$f":"IFERROR(INDEX(Feb!D:D,MATCH(Year!A:A,Feb!A:A,0)),\"\")","v":""},{"$f":"IFERROR(INDEX(March!D:D,MATCH(Year!A:A,March!A:A,0)),\"\")","v":""},""]
[{"$f":"IF(ISERROR(Q!A31),\"\",Q!A31)","v":0},{"$f":"IFERROR(INDEX(April!D:D,MATCH(Year!A:A,April!A:A,0)),\"\")","v":""},{"$f":"IFERROR(INDEX(May!D:D,MATCH(Year!A:A,May!A:A,0)),\"\")","v":""},{"$f":"IFERROR(INDEX(June!D:D,MATCH(Year!A:A,June!A:A,0)),\"\")","v":""},{"$f":"IFERROR(INDEX(July!D:D,MATCH(Year!A:A,July!A:A,0)),\"\")","v":""},{"$f":"IFERROR(INDEX(Aug!D:D,MATCH(Year!A:A,Aug!A:A,0)),\"\")","v":""},{"$f":"IFERROR(INDEX(Sept!D:D,MATCH(Year!A:A,Sept!A:A,0)),\"\")","v":""},{"$f":"IFERROR(INDEX(Oct!D:D,MATCH(Year!A:A,Oct!A:A,0)),\"\")","v":""},{"$f":"IFERROR(INDEX(Nov!D:D,MATCH(Year!A:A,Nov!A:A,0)),\"\")","v":""},{"$f":"IFERROR(INDEX(Dec!D:D,MATCH(Year!A:A,Dec!A:A,0)),\"\")","v":""},{"$f":"IFERROR(INDEX(Jan!D:D,MATCH(Year!A:A,Jan!A:A,0)),\"\")","v":""},{"$f":"IFERROR(INDEX(Feb!D:D,MATCH(Year!A:A,Feb!A:A,0)),\"\")","v":""},{"$f":"IFERROR(INDEX(March!D:D,MATCH(Year!A:A,March!A:A,0)),\"\")","v":""},""]
[{"$f":"IF(ISERROR(Q!A32),\"\",Q!A32)","v":0},{"$f":"IFERROR(INDEX(April!D:D,MATCH(Year!A:A,April!A:A,0)),\"\")","v":""},{"$f":"IFERROR(INDEX(May!D:D,MATCH(Year!A:A,May!A:A,0)),\"\")","v":""},{"$f":"IFERROR(INDEX(June!D:D,MATCH(Year!A:A,June!A:A,0)),\"\")","v":""},{"$f":"IFERROR(INDEX(July!D:D,MATCH(Year!A:A,July!A:A,0)),\"\")","v":""},{"$f":"IFERROR(INDEX(Aug!D:D,MATCH(Year!A:A,Aug!A:A,0)),\"\")","v":""},{"$f":"IFERROR(INDEX(Sept!D:D,MATCH(Year!A:A,Sept!A:A,0)),\"\")","v":""},{"$f":"IFERROR(INDEX(Oct!D:D,MATCH(Year!A:A,Oct!A:A,0)),\"\")","v":""},{"$f":"IFERROR(INDEX(Nov!D:D,MATCH(Year!A:A,Nov!A:A,0)),\"\")","v":""},{"$f":"IFERROR(INDEX(Dec!D:D,MATCH(Year!A:A,Dec!A:A,0)),\"\")","v":""},{"$f":"IFERROR(INDEX(Jan!D:D,MATCH(Year!A:A,Jan!A:A,0)),\"\")","v":""},{"$f":"IFERROR(INDEX(Feb!D:D,MATCH(Year!A:A,Feb!A:A,0)),\"\")","v":""},{"$f":"IFERROR(INDEX(March!D:D,MATCH(Year!A:A,March!A:A,0)),\"\")","v":""},""]
[{"$f":"IF(ISERROR(Q!A33),\"\",Q!A33)","v":0},{"$f":"IFERROR(INDEX(April!D:D,MATCH(Year!A:A,April!A:A,0)),\"\")","v":""},{"$f":"IFERROR(INDEX(May!D:D,MATCH(Year!A:A,May!A:A,0)),\"\")","v":""},{"$f":"IFERROR(INDEX(June!D:D,MATCH(Year!A:A,June!A:A,0)),\"\")","v":""},{"$f":"IFERROR(INDEX(July!D:D,MATCH(Year!A:A,July!A:A,0)),\"\")","v":""},{"$f":"IFERROR(INDEX(Aug!D:D,MATCH(Year!A:A,Aug!A:A,0)),\"\")","v":""},{"$f":"IFERROR(INDEX(Sept!D:D,MATCH(Year!A:A,Sept!A:A,0)),\"\")","v":""},{"$f":"IFERROR(INDEX(Oct!D:D,MATCH(Year!A:A,Oct!A:A,0)),\"\")","v":""},{"$f":"IFERROR(INDEX(Nov!D:D,MATCH(Year!A:A,Nov!A:A,0)),\"\")","v":""},{"$f":"IFERROR(INDEX(Dec!D:D,MATCH(Year!A:A,Dec!A:A,0)),\"\")","v":""},{"$f":"IFERROR(INDEX(Jan!D:D,MATCH(Year!A:A,Jan!A:A,0)),\"\")","v":""},{"$f":"IFERROR(INDEX(Feb!D:D,MATCH(Year!A:A,Feb!A:A,0)),\"\")","v":""},{"$f":"IFERROR(INDEX(March!D:D,MATCH(Year!A:A,March!A:A,0)),\"\")","v":""},""]
[{"$f":"IF(ISERROR(Q!A34),\"\",Q!A34)","v":0},{"$f":"IFERROR(INDEX(April!D:D,MATCH(Year!A:A,April!A:A,0)),\"\")","v":""},{"$f":"IFERROR(INDEX(May!D:D,MATCH(Year!A:A,May!A:A,0)),\"\")","v":""},{"$f":"IFERROR(INDEX(June!D:D,MATCH(Year!A:A,June!A:A,0)),\"\")","v":""},{"$f":"IFERROR(INDEX(July!D:D,MATCH(Year!A:A,July!A:A,0)),\"\")","v":""},{"$f":"IFERROR(INDEX(Aug!D:D,MATCH(Year!A:A,Aug!A:A,0)),\"\")","v":""},{"$f":"IFERROR(INDEX(Sept!D:D,MATCH(Year!A:A,Sept!A:A,0)),\"\")","v":""},{"$f":"IFERROR(INDEX(Oct!D:D,MATCH(Year!A:A,Oct!A:A,0)),\"\")","v":""},{"$f":"IFERROR(INDEX(Nov!D:D,MATCH(Year!A:A,Nov!A:A,0)),\"\")","v":""},{"$f":"IFERROR(INDEX(Dec!D:D,MATCH(Year!A:A,Dec!A:A,0)),\"\")","v":""},{"$f":"IFERROR(INDEX(Jan!D:D,MATCH(Year!A:A,Jan!A:A,0)),\"\")","v":""},{"$f":"IFERROR(INDEX(Feb!D:D,MATCH(Year!A:A,Feb!A:A,0)),\"\")","v":""},{"$f":"IFERROR(INDEX(March!D:D,MATCH(Year!A:A,March!A:A,0)),\"\")","v":""},""]
[{"$f":"IF(ISERROR(Q!A35),\"\",Q!A35)","v":0},{"$f":"IFERROR(INDEX(April!D:D,MATCH(Year!A:A,April!A:A,0)),\"\")","v":""},{"$f":"IFERROR(INDEX(May!D:D,MATCH(Year!A:A,May!A:A,0)),\"\")","v":""},{"$f":"IFERROR(INDEX(June!D:D,MATCH(Year!A:A,June!A:A,0)),\"\")","v":""},{"$f":"IFERROR(INDEX(July!D:D,MATCH(Year!A:A,July!A:A,0)),\"\")","v":""},{"$f":"IFERROR(INDEX(Aug!D:D,MATCH(Year!A:A,Aug!A:A,0)),\"\")","v":""},{"$f":"IFERROR(INDEX(Sept!D:D,MATCH(Year!A:A,Sept!A:A,0)),\"\")","v":""},{"$f":"IFERROR(INDEX(Oct!D:D,MATCH(Year!A:A,Oct!A:A,0)),\"\")","v":""},{"$f":"IFERROR(INDEX(Nov!D:D,MATCH(Year!A:A,Nov!A:A,0)),\"\")","v":""},{"$f":"IFERROR(INDEX(Dec!D:D,MATCH(Year!A:A,Dec!A:A,0)),\"\")","v":""},{"$f":"IFERROR(INDEX(Jan!D:D,MATCH(Year!A:A,Jan!A:A,0)),\"\")","v":""},{"$f":"IFERROR(INDEX(Feb!D:D,MATCH(Year!A:A,Feb!A:A,0)),\"\")","v":""},{"$f":"IFERROR(INDEX(March!D:D,MATCH(Year!A:A,March!A:A,0)),\"\")","v":""},""]
[{"$f":"IF(ISERROR(Q!A36),\"\",Q!A36)","v":0},{"$f":"IFERROR(INDEX(April!D:D,MATCH(Year!A:A,April!A:A,0)),\"\")","v":""},{"$f":"IFERROR(INDEX(May!D:D,MATCH(Year!A:A,May!A:A,0)),\"\")","v":""},{"$f":"IFERROR(INDEX(June!D:D,MATCH(Year!A:A,June!A:A,0)),\"\")","v":""},{"$f":"IFERROR(INDEX(July!D:D,MATCH(Year!A:A,July!A:A,0)),\"\")","v":""},{"$f":"IFERROR(INDEX(Aug!D:D,MATCH(Year!A:A,Aug!A:A,0)),\"\")","v":""},{"$f":"IFERROR(INDEX(Sept!D:D,MATCH(Year!A:A,Sept!A:A,0)),\"\")","v":""},{"$f":"IFERROR(INDEX(Oct!D:D,MATCH(Year!A:A,Oct!A:A,0)),\"\")","v":""},{"$f":"IFERROR(INDEX(Nov!D:D,MATCH(Year!A:A,Nov!A:A,0)),\"\")","v":""},{"$f":"IFERROR(INDEX(Dec!D:D,MATCH(Year!A:A,Dec!A:A,0)),\"\")","v":""},{"$f":"IFERROR(INDEX(Jan!D:D,MATCH(Year!A:A,Jan!A:A,0)),\"\")","v":""},{"$f":"IFERROR(INDEX(Feb!D:D,MATCH(Year!A:A,Feb!A:A,0)),\"\")","v":""},{"$f":"IFERROR(INDEX(March!D:D,MATCH(Year!A:A,March!A:A,0)),\"\")","v":""},""]
[{"$f":"IF(ISERROR(Q!A37),\"\",Q!A37)","v":0},{"$f":"IFERROR(INDEX(April!D:D,MATCH(Year!A:A,April!A:A,0)),\"\")","v":""},{"$f":"IFERROR(INDEX(May!D:D,MATCH(Year!A:A,May!A:A,0)),\"\")","v":""},{"$f":"IFERROR(INDEX(June!D:D,MATCH(Year!A:A,June!A:A,0)),\"\")","v":""},{"$f":"IFERROR(INDEX(July!D:D,MATCH(Year!A:A,July!A:A,0)),\"\")","v":""},{"$f":"IFERROR(INDEX(Aug!D:D,MATCH(Year!A:A,Aug!A:A,0)),\"\")","v":""},{"$f":"IFERROR(INDEX(Sept!D:D,MATCH(Year!A:A,Sept!A:A,0)),\"\")","v":""},{"$f":"IFERROR(INDEX(Oct!D:D,MATCH(Year!A:A,Oct!A:A,0)),\"\")","v":""},{"$f":"IFERROR(INDEX(Nov!D:D,MATCH(Year!A:A,Nov!A:A,0)),\"\")","v":""},{"$f":"IFERROR(INDEX(Dec!D:D,MATCH(Year!A:A,Dec!A:A,0)),\"\")","v":""},{"$f":"IFERROR(INDEX(Jan!D:D,MATCH(Year!A:A,Jan!A:A,0)),\"\")","v":""},{"$f":"IFERROR(INDEX(Feb!D:D,MATCH(Year!A:A,Feb!A:A,0)),\"\")","v":""},{"$f":"IFERROR(INDEX(March!D:D,MATCH(Year!A:A,March!A:A,0)),\"\")","v":""},""]
[{"$f":"IF(ISERROR(Q!A38),\"\",Q!A38)","v":0},{"$f":"IFERROR(INDEX(April!D:D,MATCH(Year!A:A,April!A:A,0)),\"\")","v":""},{"$f":"IFERROR(INDEX(May!D:D,MATCH(Year!A:A,May!A:A,0)),\"\")","v":""},{"$f":"IFERROR(INDEX(June!D:D,MATCH(Year!A:A,June!A:A,0)),\"\")","v":""},{"$f":"IFERROR(INDEX(July!D:D,MATCH(Year!A:A,July!A:A,0)),\"\")","v":""},{"$f":"IFERROR(INDEX(Aug!D:D,MATCH(Year!A:A,Aug!A:A,0)),\"\")","v":""},{"$f":"IFERROR(INDEX(Sept!D:D,MATCH(Year!A:A,Sept!A:A,0)),\"\")","v":""},{"$f":"IFERROR(INDEX(Oct!D:D,MATCH(Year!A:A,Oct!A:A,0)),\"\")","v":""},{"$f":"IFERROR(INDEX(Nov!D:D,MATCH(Year!A:A,Nov!A:A,0)),\"\")","v":""},{"$f":"IFERROR(INDEX(Dec!D:D,MATCH(Year!A:A,Dec!A:A,0)),\"\")","v":""},{"$f":"IFERROR(INDEX(Jan!D:D,MATCH(Year!A:A,Jan!A:A,0)),\"\")","v":""},{"$f":"IFERROR(INDEX(Feb!D:D,MATCH(Year!A:A,Feb!A:A,0)),\"\")","v":""},{"$f":"IFERROR(INDEX(March!D:D,MATCH(Year!A:A,March!A:A,0)),\"\")","v":""},""]
[{"$f":"IF(ISERROR(Q!A39),\"\",Q!A39)","v":0},{"$f":"IFERROR(INDEX(April!D:D,MATCH(Year!A:A,April!A:A,0)),\"\")","v":""},{"$f":"IFERROR(INDEX(May!D:D,MATCH(Year!A:A,May!A:A,0)),\"\")","v":""},{"$f":"IFERROR(INDEX(June!D:D,MATCH(Year!A:A,June!A:A,0)),\"\")","v":""},{"$f":"IFERROR(INDEX(July!D:D,MATCH(Year!A:A,July!A:A,0)),\"\")","v":""},{"$f":"IFERROR(INDEX(Aug!D:D,MATCH(Year!A:A,Aug!A:A,0)),\"\")","v":""},{"$f":"IFERROR(INDEX(Sept!D:D,MATCH(Year!A:A,Sept!A:A,0)),\"\")","v":""},{"$f":"IFERROR(INDEX(Oct!D:D,MATCH(Year!A:A,Oct!A:A,0)),\"\")","v":""},{"$f":"IFERROR(INDEX(Nov!D:D,MATCH(Year!A:A,Nov!A:A,0)),\"\")","v":""},{"$f":"IFERROR(INDEX(Dec!D:D,MATCH(Year!A:A,Dec!A:A,0)),\"\")","v":""},{"$f":"IFERROR(INDEX(Jan!D:D,MATCH(Year!A:A,Jan!A:A,0)),\"\")","v":""},{"$f":"IFERROR(INDEX(Feb!D:D,MATCH(Year!A:A,Feb!A:A,0)),\"\")","v":""},{"$f":"IFERROR(INDEX(March!D:D,MATCH(Year!A:A,March!A:A,0)),\"\")","v":""},""]
[{"$f":"IF(ISERROR(Q!A40),\"\",Q!A40)","v":0},{"$f":"IFERROR(INDEX(April!D:D,MATCH(Year!A:A,April!A:A,0)),\"\")","v":""},{"$f":"IFERROR(INDEX(May!D:D,MATCH(Year!A:A,May!A:A,0)),\"\")","v":""},{"$f":"IFERROR(INDEX(June!D:D,MATCH(Year!A:A,June!A:A,0)),\"\")","v":""},{"$f":"IFERROR(INDEX(July!D:D,MATCH(Year!A:A,July!A:A,0)),\"\")","v":""},{"$f":"IFERROR(INDEX(Aug!D:D,MATCH(Year!A:A,Aug!A:A,0)),\"\")","v":""},{"$f":"IFERROR(INDEX(Sept!D:D,MATCH(Year!A:A,Sept!A:A,0)),\"\")","v":""},{"$f":"IFERROR(INDEX(Oct!D:D,MATCH(Year!A:A,Oct!A:A,0)),\"\")","v":""},{"$f":"IFERROR(INDEX(Nov!D:D,MATCH(Year!A:A,Nov!A:A,0)),\"\")","v":""},{"$f":"IFERROR(INDEX(Dec!D:D,MATCH(Year!A:A,Dec!A:A,0)),\"\")","v":""},{"$f":"IFERROR(INDEX(Jan!D:D,MATCH(Year!A:A,Jan!A:A,0)),\"\")","v":""},{"$f":"IFERROR(INDEX(Feb!D:D,MATCH(Year!A:A,Feb!A:A,0)),\"\")","v":""},{"$f":"IFERROR(INDEX(March!D:D,MATCH(Year!A:A,March!A:A,0)),\"\")","v":""},""]
[{"$f":"IF(ISERROR(Q!A41),\"\",Q!A41)","v":0},{"$f":"IFERROR(INDEX(April!D:D,MATCH(Year!A:A,April!A:A,0)),\"\")","v":""},{"$f":"IFERROR(INDEX(May!D:D,MATCH(Year!A:A,May!A:A,0)),\"\")","v":""},{"$f":"IFERROR(INDEX(June!D:D,MATCH(Year!A:A,June!A:A,0)),\"\")","v":""},{"$f":"IFERROR(INDEX(July!D:D,MATCH(Year!A:A,July!A:A,0)),\"\")","v":""},{"$f":"IFERROR(INDEX(Aug!D:D,MATCH(Year!A:A,Aug!A:A,0)),\"\")","v":""},{"$f":"IFERROR(INDEX(Sept!D:D,MATCH(Year!A:A,Sept!A:A,0)),\"\")","v":""},{"$f":"IFERROR(INDEX(Oct!D:D,MATCH(Year!A:A,Oct!A:A,0)),\"\")","v":""},{"$f":"IFERROR(INDEX(Nov!D:D,MATCH(Year!A:A,Nov!A:A,0)),\"\")","v":""},{"$f":"IFERROR(INDEX(Dec!D:D,MATCH(Year!A:A,Dec!A:A,0)),\"\")","v":""},{"$f":"IFERROR(INDEX(Jan!D:D,MATCH(Year!A:A,Jan!A:A,0)),\"\")","v":""},{"$f":"IFERROR(INDEX(Feb!D:D,MATCH(Year!A:A,Feb!A:A,0)),\"\")","v":""},{"$f":"IFERROR(INDEX(March!D:D,MATCH(Year!A:A,March!A:A,0)),\"\")","v":""},""]
["Average",{"$f":"IF(ISERROR((SUM(B58:B97)/April!B8)),\"\",(SUM(B58:B97)/April!B8))","v":0.87272727272727257},{"$f":"IF(ISERROR((SUM(C58:C97)/May!B8)),\"\",(SUM(C58:C97)/May!B8))","v":0.88636363636363635},{"$f":"IF(ISERROR((SUM(D58:D97)/June!B8)),\"\",(SUM(D58:D97)/June!B8))","v":0.94545454545454544},{"$f":"IF(ISERROR((SUM(E58:E97)/July!B8)),\"\",(SUM(E58:E97)/July!B8))","v":0.96363636363636362},{"$f":"IF(ISERROR((SUM(F58:F97)/Aug!B8)),\"\",(SUM(F58:F97)/Aug!B8))","v":0.96363636363636362},{"$f":"IF(ISERROR((SUM(G58:G97)/Sept!B8)),\"\",(SUM(G58:G97)/Sept!B8))","v":0.97727272727272729},{"$f":"IF(ISERROR((SUM(H58:H97)/Oct!B8)),\"\",(SUM(H58:H97)/Oct!B8))","v":0.96969696969696961},{"$f":"IF(ISERROR((SUM(I58:I97)/Nov!B8)),\"\",(SUM(I58:I97)/Nov!B8))","v":0.86363636363636365},{"$f":"IF(ISERROR((SUM(J58:J97)/Dec!B8)),\"\",(SUM(J58:J97)/Dec!B8))","v":0.96363636363636362},{"$f":"IF(ISERROR((SUM(K58:K97)/Jan!B8)),\"\",(SUM(K58:K97)/Jan!B8))","v":0.96969696969696983},{"$f":"IF(ISERROR((SUM(L58:L97)/Feb!B8)),\"\",(SUM(L58:L97)/Feb!B8))","v":0.94090909090909092},{"$f":"IF(ISERROR((SUM(M58:M97)/March!B8)),\"\",(SUM(M58:M97)/March!B8))","v":0.8787878787878789},{"$f":"IF(ISERROR((SUM(B98:M98))/B4),\"\",(SUM(B98:M98))/B4)","v":0.93295454545454559}]
[]
["Justified"]
["Metric","April","May","June","July","August","September","October","November","December","January","February","March","Year average"]
[{"$f":"IF(ISERROR(Q!A2),\"\",Q!A2)","v":"Was a Room number documented?"},{"$f":"IFERROR(INDEX(April!E:E,MATCH(Year!A:A,April!A:A,0)),\"\")","v":0},{"$f":"IFERROR(INDEX(May!E:E,MATCH(Year!A:A,May!A:A,0)),\"\")","v":0},{"$f":"IFERROR(INDEX(June!E:E,MATCH(Year!A:A,June!A:A,0)),\"\")","v":0},{"$f":"IFERROR(INDEX(July!E:E,MATCH(Year!A:A,July!A:A,0)),\"\")","v":0},{"$f":"IFERROR(INDEX(Aug!E:E,MATCH(Year!A:A,Aug!A:A,0)),\"\")","v":0},{"$f":"IFERROR(INDEX(Sept!E:E,MATCH(Year!A:A,Sept!A:A,0)),\"\")","v":0},{"$f":"IFERROR(INDEX(Oct!E:E,MATCH(Year!A:A,Oct!A:A,0)),\"\")","v":0},{"$f":"IFERROR(INDEX(Nov!E:E,MATCH(Year!A:A,Nov!A:A,0)),\"\")","v":0},{"$f":"IFERROR(INDEX(Dec!E:E,MATCH(Year!A:A,Dec!A:A,0)),\"\")","v":0},{"$f":"IFERROR(INDEX(Jan!E:E,MATCH(Year!A:A,Jan!A:A,0)),\"\")","v":0},{"$f":"IFERROR(INDEX(Feb!E:E,MATCH(Year!A:A,Feb!A:A,0)),\"\")","v":0},{"$f":"IFERROR(INDEX(March!E:E,MATCH(Year!A:A,March!A:A,0)),\"\")","v":0},{"$f":"IF(ISERROR((SUM(B102:M102))/B4),\"\",(SUM(B102:M102))/B4)","v":0}]
[{"$f":"IF(ISERROR(Q!A3),\"\",Q!A3)","v":"Were stage A checks completed as appropriate?"},{"$f":"IFERROR(INDEX(April!E:E,MATCH(Year!A:A,April!A:A,0)),\"\")","v":0},{"$f":"IFERROR(INDEX(May!E:E,MATCH(Year!A:A,May!A:A,0)),\"\")","v":0},{"$f":"IFERROR(INDEX(June!E:E,MATCH(Year!A:A,June!A:A,0)),\"\")","v":0},{"$f":"IFERROR(INDEX(July!E:E,MATCH(Year!A:A,July!A:A,0)),\"\")","v":0},{"$f":"IFERROR(INDEX(Aug!E:E,MATCH(Year!A:A,Aug!A:A,0)),\"\")","v":0},{"$f":"IFERROR(INDEX(Sept!E:E,MATCH(Year!A:A,Sept!A:A,0)),\"\")","v":0},{"$f":"IFERROR(INDEX(Oct!E:E,MATCH(Year!A:A,Oct!A:A,0)),\"\")","v":0},{"$f":"IFERROR(INDEX(Nov!E:E,MATCH(Year!A:A,Nov!A:A,0)),\"\")","v":0},{"$f":"IFERROR(INDEX(Dec!E:E,MATCH(Year!A:A,Dec!A:A,0)),\"\")","v":0},{"$f":"IFERROR(INDEX(Jan!E:E,MATCH(Year!A:A,Jan!A:A,0)),\"\")","v":0},{"$f":"IFERROR(INDEX(Feb!E:E,MATCH(Year!A:A,Feb!A:A,0)),\"\")","v":0},{"$f":"IFERROR(INDEX(March!E:E,MATCH(Year!A:A,March!A:A,0)),\"\")","v":0},{"$f":"IF(ISERROR((SUM(B103:M103))/B4),\"\",(SUM(B103:M103))/B4)","v":0}]
[{"$f":"IF(ISERROR(Q!A4),\"\",Q!A4)","v":"Was COSI Part 1 performed?"},{"$f":"IFERROR(INDEX(April!E:E,MATCH(Year!A:A,April!A:A,0)),\"\")","v":0},{"$f":"IFERROR(INDEX(May!E:E,MATCH(Year!A:A,May!A:A,0)),\"\")","v":0},{"$f":"IFERROR(INDEX(June!E:E,MATCH(Year!A:A,June!A:A,0)),\"\")","v":0},{"$f":"IFERROR(INDEX(July!E:E,MATCH(Year!A:A,July!A:A,0)),\"\")","v":0},{"$f":"IFERROR(INDEX(Aug!E:E,MATCH(Year!A:A,Aug!A:A,0)),\"\")","v":0},{"$f":"IFERROR(INDEX(Sept!E:E,MATCH(Year!A:A,Sept!A:A,0)),\"\")","v":0},{"$f":"IFERROR(INDEX(Oct!E:E,MATCH(Year!A:A,Oct!A:A,0)),\"\")","v":0},{"$f":"IFERROR(INDEX(Nov!E:E,MATCH(Year!A:A,Nov!A:A,0)),\"\")","v":0},{"$f":"IFERROR(INDEX(Dec!E:E,MATCH(Year!A:A,Dec!A:A,0)),\"\")","v":0},{"$f":"IFERROR(INDEX(Jan!E:E,MATCH(Year!A:A,Jan!A:A,0)),\"\")","v":0},{"$f":"IFERROR(INDEX(Feb!E:E,MATCH(Year!A:A,Feb!A:A,0)),\"\")","v":0},{"$f":"IFERROR(INDEX(March!E:E,MATCH(Year!A:A,March!A:A,0)),\"\")","v":0},{"$f":"IF(ISERROR((SUM(B104:M104))/B4),\"\",(SUM(B104:M104))/B4)","v":0}]
[{"$f":"IF(ISERROR(Q!A5),\"\",Q!A5)","v":"Was PVP documented?"},{"$f":"IFERROR(INDEX(April!E:E,MATCH(Year!A:A,April!A:A,0)),\"\")","v":0},{"$f":"IFERROR(INDEX(May!E:E,MATCH(Year!A:A,May!A:A,0)),\"\")","v":0},{"$f":"IFERROR(INDEX(June!E:E,MATCH(Year!A:A,June!A:A,0)),\"\")","v":0},{"$f":"IFERROR(INDEX(July!E:E,MATCH(Year!A:A,July!A:A,0)),\"\")","v":0},{"$f":"IFERROR(INDEX(Aug!E:E,MATCH(Year!A:A,Aug!A:A,0)),\"\")","v":0},{"$f":"IFERROR(INDEX(Sept!E:E,MATCH(Year!A:A,Sept!A:A,0)),\"\")","v":0},{"$f":"IFERROR(INDEX(Oct!E:E,MATCH(Year!A:A,Oct!A:A,0)),\"\")","v":0},{"$f":"IFERROR(INDEX(Nov!E:E,MATCH(Year!A:A,Nov!A:A,0)),\"\")","v":0},{"$f":"IFERROR(INDEX(Dec!E:E,MATCH(Year!A:A,Dec!A:A,0)),\"\")","v":0},{"$f":"IFERROR(INDEX(Jan!E:E,MATCH(Year!A:A,Jan!A:A,0)),\"\")","v":0},{"$f":"IFERROR(INDEX(Feb!E:E,MATCH(Year!A:A,Feb!A:A,0)),\"\")","v":0},{"$f":"IFERROR(INDEX(March!E:E,MATCH(Year!A:A,March!A:A,0)),\"\")","v":0},{"$f":"IF(ISERROR((SUM(B105:M105))/B4),\"\",(SUM(B105:M105))/B4)","v":0}]
[{"$f":"IF(ISERROR(Q!A6),\"\",Q!A6)","v":"Was Otoscopy documented?"},{"$f":"IFERROR(INDEX(April!E:E,MATCH(Year!A:A,April!A:A,0)),\"\")","v":0},{"$f":"IFERROR(INDEX(May!E:E,MATCH(Year!A:A,May!A:A,0)),\"\")","v":0},{"$f":"IFERROR(INDEX(June!E:E,MATCH(Year!A:A,June!A:A,0)),\"\")","v":0},{"$f":"IFERROR(INDEX(July!E:E,MATCH(Year!A:A,July!A:A,0)),\"\")","v":0},{"$f":"IFERROR(INDEX(Aug!E:E,MATCH(Year!A:A,Aug!A:A,0)),\"\")","v":0},{"$f":"IFERROR(INDEX(Sept!E:E,MATCH(Year!A:A,Sept!A:A,0)),\"\")","v":0},{"$f":"IFERROR(INDEX(Oct!E:E,MATCH(Year!A:A,Oct!A:A,0)),\"\")","v":0},{"$f":"IFERROR(INDEX(Nov!E:E,MATCH(Year!A:A,Nov!A:A,0)),\"\")","v":0},{"$f":"IFERROR(INDEX(Dec!E:E,MATCH(Year!A:A,Dec!A:A,0)),\"\")","v":0},{"$f":"IFERROR(INDEX(Jan!E:E,MATCH(Year!A:A,Jan!A:A,0)),\"\")","v":0},{"$f":"IFERROR(INDEX(Feb!E:E,MATCH(Year!A:A,Feb!A:A,0)),\"\")","v":0},{"$f":"IFERROR(INDEX(March!E:E,MATCH(Year!A:A,March!A:A,0)),\"\")","v":0},{"$f":"IF(ISERROR((SUM(B106:M106))/B4),\"\",(SUM(B106:M106))/B4)","v":0}]
[{"$f":"IF(ISERROR(Q!A7),\"\",Q!A7)","v":"Document bc at 3 & 4kHz is for programming purposes?"},{"$f":"IFERROR(INDEX(April!E:E,MATCH(Year!A:A,April!A:A,0)),\"\")","v":0},{"$f":"IFERROR(INDEX(May!E:E,MATCH(Year!A:A,May!A:A,0)),\"\")","v":0},{"$f":"IFERROR(INDEX(June!E:E,MATCH(Year!A:A,June!A:A,0)),\"\")","v":0},{"$f":"IFERROR(INDEX(July!E:E,MATCH(Year!A:A,July!A:A,0)),\"\")","v":0},{"$f":"IFERROR(INDEX(Aug!E:E,MATCH(Year!A:A,Aug!A:A,0)),\"\")","v":0},{"$f":"IFERROR(INDEX(Sept!E:E,MATCH(Year!A:A,Sept!A:A,0)),\"\")","v":0},{"$f":"IFERROR(INDEX(Oct!E:E,MATCH(Year!A:A,Oct!A:A,0)),\"\")","v":0},{"$f":"IFERROR(INDEX(Nov!E:E,MATCH(Year!A:A,Nov!A:A,0)),\"\")","v":0},{"$f":"IFERROR(INDEX(Dec!E:E,MATCH(Year!A:A,Dec!A:A,0)),\"\")","v":0},{"$f":"IFERROR(INDEX(Jan!E:E,MATCH(Year!A:A,Jan!A:A,0)),\"\")","v":0},{"$f":"IFERROR(INDEX(Feb!E:E,MATCH(Year!A:A,Feb!A:A,0)),\"\")","v":0},{"$f":"IFERROR(INDEX(March!E:E,MATCH(Year!A:A,March!A:A,0)),\"\")","v":0.33333333333333331},{"$f":"IF(ISERROR((SUM(B107:M107))/B4),\"\",(SUM(B107:M107))/B4)","v":2.7777777777777776E-2}]
[{"$f":"IF(ISERROR(Q!A8),\"\",Q!A8)","v":"Was Speech testing performed?"},{"$f":"IFERROR(INDEX(April!E:E,MATCH(Year!A:A,April!A:A,0)),\"\")","v":0.4},{"$f":"IFERROR(INDEX(May!E:E,MATCH(Year!A:A,May!A:A,0)),\"\")","v":0.5},{"$f":"IFERROR(INDEX(June!E:E,MATCH(Year!A:A,June!A:A,0)),\"\")","v":0.2},{"$f":"IFERROR(INDEX(July!E:E,MATCH(Year!A:A,July!A:A,0)),\"\")","v":0.2},{"$f":"IFERROR(INDEX(Aug!E:E,MATCH(Year!A:A,Aug!A:A,0)),\"\")","v":0},{"$f":"IFERROR(INDEX(Sept!E:E,MATCH(Year!A:A,Sept!A:A,0)),\"\")","v":0},{"$f":"IFERROR(INDEX(Oct!E:E,MATCH(Year!A:A,Oct!A:A,0)),\"\")","v":0},{"$f":"IFERROR(INDEX(Nov!E:E,MATCH(Year!A:A,Nov!A:A,0)),\"\")","v":0.5},{"$f":"IFERROR(INDEX(Dec!E:E,MATCH(Year!A:A,Dec!A:A,0)),\"\")","v":0},{"$f":"IFERROR(INDEX(Jan!E:E,MATCH(Year!A:A,Jan!A:A,0)),\"\")","v":0},{"$f":"IFERROR(INDEX(Feb!E:E,MATCH(Year!A:A,Feb!A:A,0)),\"\")","v":0},{"$f":"IFERROR(INDEX(March!E:E,MATCH(Year!A:A,March!A:A,0)),\"\")","v":0.33333333333333331},{"$f":"IF(ISERROR((SUM(B108:M108))/B4),\"\",(SUM(B108:M108))/B4)","v":0.17777777777777778}]
[{"$f":"IF(ISERROR(Q!A9),\"\",Q!A9)","v":"Is it documented whether national criteria were/were not met?"},{"$f":"IFERROR(INDEX(April!E:E,MATCH(Year!A:A,April!A:A,0)),\"\")","v":0},{"$f":"IFERROR(INDEX(May!E:E,MATCH(Year!A:A,May!A:A,0)),\"\")","v":0},{"$f":"IFERROR(INDEX(June!E:E,MATCH(Year!A:A,June!A:A,0)),\"\")","v":0},{"$f":"IFERROR(INDEX(July!E:E,MATCH(Year!A:A,July!A:A,0)),\"\")","v":0},{"$f":"IFERROR(INDEX(Aug!E:E,MATCH(Year!A:A,Aug!A:A,0)),\"\")","v":0},{"$f":"IFERROR(INDEX(Sept!E:E,MATCH(Year!A:A,Sept!A:A,0)),\"\")","v":0},{"$f":"IFERROR(INDEX(Oct!E:E,MATCH(Year!A:A,Oct!A:A,0)),\"\")","v":0},{"$f":"IFERROR(INDEX(Nov!E:E,MATCH(Year!A:A,Nov!A:A,0)),\"\")","v":0.25},{"$f":"IFERROR(INDEX(Dec!E:E,MATCH(Year!A:A,Dec!A:A,0)),\"\")","v":0},{"$f":"IFERROR(INDEX(Jan!E:E,MATCH(Year!A:A,Jan!A:A,0)),\"\")","v":0},{"$f":"IFERROR(INDEX(Feb!E:E,MATCH(Year!A:A,Feb!A:A,0)),\"\")","v":0},{"$f":"IFERROR(INDEX(March!E:E,MATCH(Year!A:A,March!A:A,0)),\"\")","v":0},{"$f":"IF(ISERROR((SUM(B109:M109))/B4),\"\",(SUM(B109:M109))/B4)","v":2.0833333333333332E-2}]
[{"$f":"IF(ISERROR(Q!A10),\"\",Q!A10)","v":"Was a BCHI info pack supplied?"},{"$f":"IFERROR(INDEX(April!E:E,MATCH(Year!A:A,April!A:A,0)),\"\")","v":0.4},{"$f":"IFERROR(INDEX(May!E:E,MATCH(Year!A:A,May!A:A,0)),\"\")","v":0},{"$f":"IFERROR(INDEX(June!E:E,MATCH(Year!A:A,June!A:A,0)),\"\")","v":0.2},{"$f":"IFERROR(INDEX(July!E:E,MATCH(Year!A:A,July!A:A,0)),\"\")","v":0},{"$f":"IFERROR(INDEX(Aug!E:E,MATCH(Year!A:A,Aug!A:A,0)),\"\")","v":0.2},{"$f":"IFERROR(INDEX(Sept!E:E,MATCH(Year!A:A,Sept!A:A,0)),\"\")","v":0},{"$f":"IFERROR(INDEX(Oct!E:E,MATCH(Year!A:A,Oct!A:A,0)),\"\")","v":0.33333333333333331},{"$f":"IFERROR(INDEX(Nov!E:E,MATCH(Year!A:A,Nov!A:A,0)),\"\")","v":0.5},{"$f":"IFERROR(INDEX(Dec!E:E,MATCH(Year!A:A,Dec!A:A,0)),\"\")","v":0},{"$f":"IFERROR(INDEX(Jan!E:E,MATCH(Year!A:A,Jan!A:A,0)),\"\")","v":0},{"$f":"IFERROR(INDEX(Feb!E:E,MATCH(Year!A:A,Feb!A:A,0)),\"\")","v":0},{"$f":"IFERROR(INDEX(March!E:E,MATCH(Year!A:A,March!A:A,0)),\"\")","v":0.33333333333333331},{"$f":"IF(ISERROR((SUM(B110:M110))/B4),\"\",(SUM(B110:M110))/B4)","v":0.16388888888888889}]
[{"$f":"IF(ISERROR(Q!A11),\"\",Q!A11)","v":"Was the report authorised & issued within target (7 days)?"},{"$f":"IFERROR(INDEX(April!E:E,MATCH(Year!A:A,April!A:A,0)),\"\")","v":0},{"$f":"IFERROR(INDEX(May!E:E,MATCH(Year!A:A,May!A:A,0)),\"\")","v":0},{"$f":"IFERROR(INDEX(June!E:E,MATCH(Year!A:A,June!A:A,0)),\"\")","v":0},{"$f":"IFERROR(INDEX(July!E:E,MATCH(Year!A:A,July!A:A,0)),\"\")","v":0},{"$f":"IFERROR(INDEX(Aug!E:E,MATCH(Year!A:A,Aug!A:A,0)),\"\")","v":0},{"$f":"IFERROR(INDEX(Sept!E:E,MATCH(Year!A:A,Sept!A:A,0)),\"\")","v":0},{"$f":"IFERROR(INDEX(Oct!E:E,MATCH(Year!A:A,Oct!A:A,0)),\"\")","v":0},{"$f":"IFERROR(INDEX(Nov!E:E,MATCH(Year!A:A,Nov!A:A,0)),\"\")","v":0},{"$f":"IFERROR(INDEX(Dec!E:E,MATCH(Year!A:A,Dec!A:A,0)),\"\")","v":0},{"$f":"IFERROR(INDEX(Jan!E:E,MATCH(Year!A:A,Jan!A:A,0)),\"\")","v":0},{"$f":"IFERROR(INDEX(Feb!E:E,MATCH(Year!A:A,Feb!A:A,0)),\"\")","v":0},{"$f":"IFERROR(INDEX(March!E:E,MATCH(Year!A:A,March!A:A,0)),\"\")","v":0},{"$f":"IF(ISERROR((SUM(B111:M111))/B4),\"\",(SUM(B111:M111))/B4)","v":0}]
[{"$f":"IF(ISERROR(Q!A12),\"\",Q!A12)","v":"Was consent documented as appropriate?"},{"$f":"IFERROR(INDEX(April!E:E,MATCH(Year!A:A,April!A:A,0)),\"\")","v":0},{"$f":"IFERROR(INDEX(May!E:E,MATCH(Year!A:A,May!A:A,0)),\"\")","v":0},{"$f":"IFERROR(INDEX(June!E:E,MATCH(Year!A:A,June!A:A,0)),\"\")","v":0},{"$f":"IFERROR(INDEX(July!E:E,MATCH(Year!A:A,July!A:A,0)),\"\")","v":0},{"$f":"IFERROR(INDEX(Aug!E:E,MATCH(Year!A:A,Aug!A:A,0)),\"\")","v":0},{"$f":"IFERROR(INDEX(Sept!E:E,MATCH(Year!A:A,Sept!A:A,0)),\"\")","v":0},{"$f":"IFERROR(INDEX(Oct!E:E,MATCH(Year!A:A,Oct!A:A,0)),\"\")","v":0},{"$f":"IFERROR(INDEX(Nov!E:E,MATCH(Year!A:A,Nov!A:A,0)),\"\")","v":0},{"$f":"IFERROR(INDEX(Dec!E:E,MATCH(Year!A:A,Dec!A:A,0)),\"\")","v":0},{"$f":"IFERROR(INDEX(Jan!E:E,MATCH(Year!A:A,Jan!A:A,0)),\"\")","v":0},{"$f":"IFERROR(INDEX(Feb!E:E,MATCH(Year!A:A,Feb!A:A,0)),\"\")","v":0},{"$f":"IFERROR(INDEX(March!E:E,MATCH(Year!A:A,March!A:A,0)),\"\")","v":0},{"$f":"IF(ISERROR((SUM(B112:M112))/B4),\"\",(SUM(B112:M112))/B4)","v":0}]
[{"$f":"IF(ISERROR(Q!A13),\"\",Q!A13)","v":0},{"$f":"IFERROR(INDEX(April!E:E,MATCH(Year!A:A,April!A:A,0)),\"\")","v":""},{"$f":"IFERROR(INDEX(May!E:E,MATCH(Year!A:A,May!A:A,0)),\"\")","v":""},{"$f":"IFERROR(INDEX(June!E:E,MATCH(Year!A:A,June!A:A,0)),\"\")","v":""},{"$f":"IFERROR(INDEX(July!E:E,MATCH(Year!A:A,July!A:A,0)),\"\")","v":""},{"$f":"IFERROR(INDEX(Aug!E:E,MATCH(Year!A:A,Aug!A:A,0)),\"\")","v":""},{"$f":"IFERROR(INDEX(Sept!E:E,MATCH(Year!A:A,Sept!A:A,0)),\"\")","v":""},{"$f":"IFERROR(INDEX(Oct!E:E,MATCH(Year!A:A,Oct!A:A,0)),\"\")","v":""},{"$f":"IFERROR(INDEX(Nov!E:E,MATCH(Year!A:A,Nov!A:A,0)),\"\")","v":""},{"$f":"IFERROR(INDEX(Dec!E:E,MATCH(Year!A:A,Dec!A:A,0)),\"\")","v":""},{"$f":"IFERROR(INDEX(Jan!E:E,MATCH(Year!A:A,Jan!A:A,0)),\"\")","v":""},{"$f":"IFERROR(INDEX(Feb!E:E,MATCH(Year!A:A,Feb!A:A,0)),\"\")","v":""},{"$f":"IFERROR(INDEX(March!E:E,MATCH(Year!A:A,March!A:A,0)),\"\")","v":""},{"$f":"IF(ISERROR((SUM(B113:M113))/B4),\"\",(SUM(B113:M113))/B4)","v":0}]
[{"$f":"IF(ISERROR(Q!A14),\"\",Q!A14)","v":0},{"$f":"IFERROR(INDEX(April!E:E,MATCH(Year!A:A,April!A:A,0)),\"\")","v":""},{"$f":"IFERROR(INDEX(May!E:E,MATCH(Year!A:A,May!A:A,0)),\"\")","v":""},{"$f":"IFERROR(INDEX(June!E:E,MATCH(Year!A:A,June!A:A,0)),\"\")","v":""},{"$f":"IFERROR(INDEX(July!E:E,MATCH(Year!A:A,July!A:A,0)),\"\")","v":""},{"$f":"IFERROR(INDEX(Aug!E:E,MATCH(Year!A:A,Aug!A:A,0)),\"\")","v":""},{"$f":"IFERROR(INDEX(Sept!E:E,MATCH(Year!A:A,Sept!A:A,0)),\"\")","v":""},{"$f":"IFERROR(INDEX(Oct!E:E,MATCH(Year!A:A,Oct!A:A,0)),\"\")","v":""},{"$f":"IFERROR(INDEX(Nov!E:E,MATCH(Year!A:A,Nov!A:A,0)),\"\")","v":""},{"$f":"IFERROR(INDEX(Dec!E:E,MATCH(Year!A:A,Dec!A:A,0)),\"\")","v":""},{"$f":"IFERROR(INDEX(Jan!E:E,MATCH(Year!A:A,Jan!A:A,0)),\"\")","v":""},{"$f":"IFERROR(INDEX(Feb!E:E,MATCH(Year!A:A,Feb!A:A,0)),\"\")","v":""},{"$f":"IFERROR(INDEX(March!E:E,MATCH(Year!A:A,March!A:A,0)),\"\")","v":""},{"$f":"IF(ISERROR((SUM(B114:M114))/B4),\"\",(SUM(B114:M114))/B4)","v":0}]
[{"$f":"IF(ISERROR(Q!A15),\"\",Q!A15)","v":0},{"$f":"IFERROR(INDEX(April!E:E,MATCH(Year!A:A,April!A:A,0)),\"\")","v":""},{"$f":"IFERROR(INDEX(May!E:E,MATCH(Year!A:A,May!A:A,0)),\"\")","v":""},{"$f":"IFERROR(INDEX(June!E:E,MATCH(Year!A:A,June!A:A,0)),\"\")","v":""},{"$f":"IFERROR(INDEX(July!E:E,MATCH(Year!A:A,July!A:A,0)),\"\")","v":""},{"$f":"IFERROR(INDEX(Aug!E:E,MATCH(Year!A:A,Aug!A:A,0)),\"\")","v":""},{"$f":"IFERROR(INDEX(Sept!E:E,MATCH(Year!A:A,Sept!A:A,0)),\"\")","v":""},{"$f":"IFERROR(INDEX(Oct!E:E,MATCH(Year!A:A,Oct!A:A,0)),\"\")","v":""},{"$f":"IFERROR(INDEX(Nov!E:E,MATCH(Year!A:A,Nov!A:A,0)),\"\")","v":""},{"$f":"IFERROR(INDEX(Dec!E:E,MATCH(Year!A:A,Dec!A:A,0)),\"\")","v":""},{"$f":"IFERROR(INDEX(Jan!E:E,MATCH(Year!A:A,Jan!A:A,0)),\"\")","v":""},{"$f":"IFERROR(INDEX(Feb!E:E,MATCH(Year!A:A,Feb!A:A,0)),\"\")","v":""},{"$f":"IFERROR(INDEX(March!E:E,MATCH(Year!A:A,March!A:A,0)),\"\")","v":""},{"$f":"IF(ISERROR((SUM(B115:M115))/B4),\"\",(SUM(B115:M115))/B4)","v":0}]
[{"$f":"IF(ISERROR(Q!A16),\"\",Q!A16)","v":0},{"$f":"IFERROR(INDEX(April!E:E,MATCH(Year!A:A,April!A:A,0)),\"\")","v":""},{"$f":"IFERROR(INDEX(May!E:E,MATCH(Year!A:A,May!A:A,0)),\"\")","v":""},{"$f":"IFERROR(INDEX(June!E:E,MATCH(Year!A:A,June!A:A,0)),\"\")","v":""},{"$f":"IFERROR(INDEX(July!E:E,MATCH(Year!A:A,July!A:A,0)),\"\")","v":""},{"$f":"IFERROR(INDEX(Aug!E:E,MATCH(Year!A:A,Aug!A:A,0)),\"\")","v":""},{"$f":"IFERROR(INDEX(Sept!E:E,MATCH(Year!A:A,Sept!A:A,0)),\"\")","v":""},{"$f":"IFERROR(INDEX(Oct!E:E,MATCH(Year!A:A,Oct!A:A,0)),\"\")","v":""},{"$f":"IFERROR(INDEX(Nov!E:E,MATCH(Year!A:A,Nov!A:A,0)),\"\")","v":""},{"$f":"IFERROR(INDEX(Dec!E:E,MATCH(Year!A:A,Dec!A:A,0)),\"\")","v":""},{"$f":"IFERROR(INDEX(Jan!E:E,MATCH(Year!A:A,Jan!A:A,0)),\"\")","v":""},{"$f":"IFERROR(INDEX(Feb!E:E,MATCH(Year!A:A,Feb!A:A,0)),\"\")","v":""},{"$f":"IFERROR(INDEX(March!E:E,MATCH(Year!A:A,March!A:A,0)),\"\")","v":""},{"$f":"IF(ISERROR((SUM(B116:M116))/B4),\"\",(SUM(B116:M116))/B4)","v":0}]
[{"$f":"IF(ISERROR(Q!A17),\"\",Q!A17)","v":0},{"$f":"IFERROR(INDEX(April!E:E,MATCH(Year!A:A,April!A:A,0)),\"\")","v":""},{"$f":"IFERROR(INDEX(May!E:E,MATCH(Year!A:A,May!A:A,0)),\"\")","v":""},{"$f":"IFERROR(INDEX(June!E:E,MATCH(Year!A:A,June!A:A,0)),\"\")","v":""},{"$f":"IFERROR(INDEX(July!E:E,MATCH(Year!A:A,July!A:A,0)),\"\")","v":""},{"$f":"IFERROR(INDEX(Aug!E:E,MATCH(Year!A:A,Aug!A:A,0)),\"\")","v":""},{"$f":"IFERROR(INDEX(Sept!E:E,MATCH(Year!A:A,Sept!A:A,0)),\"\")","v":""},{"$f":"IFERROR(INDEX(Oct!E:E,MATCH(Year!A:A,Oct!A:A,0)),\"\")","v":""},{"$f":"IFERROR(INDEX(Nov!E:E,MATCH(Year!A:A,Nov!A:A,0)),\"\")","v":""},{"$f":"IFERROR(INDEX(Dec!E:E,MATCH(Year!A:A,Dec!A:A,0)),\"\")","v":""},{"$f":"IFERROR(INDEX(Jan!E:E,MATCH(Year!A:A,Jan!A:A,0)),\"\")","v":""},{"$f":"IFERROR(INDEX(Feb!E:E,MATCH(Year!A:A,Feb!A:A,0)),\"\")","v":""},{"$f":"IFERROR(INDEX(March!E:E,MATCH(Year!A:A,March!A:A,0)),\"\")","v":""},{"$f":"IF(ISERROR((SUM(B117:M117))/B4),\"\",(SUM(B117:M117))/B4)","v":0}]
[{"$f":"IF(ISERROR(Q!A18),\"\",Q!A18)","v":0},{"$f":"IFERROR(INDEX(April!E:E,MATCH(Year!A:A,April!A:A,0)),\"\")","v":""},{"$f":"IFERROR(INDEX(May!E:E,MATCH(Year!A:A,May!A:A,0)),\"\")","v":""},{"$f":"IFERROR(INDEX(June!E:E,MATCH(Year!A:A,June!A:A,0)),\"\")","v":""},{"$f":"IFERROR(INDEX(July!E:E,MATCH(Year!A:A,July!A:A,0)),\"\")","v":""},{"$f":"IFERROR(INDEX(Aug!E:E,MATCH(Year!A:A,Aug!A:A,0)),\"\")","v":""},{"$f":"IFERROR(INDEX(Sept!E:E,MATCH(Year!A:A,Sept!A:A,0)),\"\")","v":""},{"$f":"IFERROR(INDEX(Oct!E:E,MATCH(Year!A:A,Oct!A:A,0)),\"\")","v":""},{"$f":"IFERROR(INDEX(Nov!E:E,MATCH(Year!A:A,Nov!A:A,0)),\"\")","v":""},{"$f":"IFERROR(INDEX(Dec!E:E,MATCH(Year!A:A,Dec!A:A,0)),\"\")","v":""},{"$f":"IFERROR(INDEX(Jan!E:E,MATCH(Year!A:A,Jan!A:A,0)),\"\")","v":""},{"$f":"IFERROR(INDEX(Feb!E:E,MATCH(Year!A:A,Feb!A:A,0)),\"\")","v":""},{"$f":"IFERROR(INDEX(March!E:E,MATCH(Year!A:A,March!A:A,0)),\"\")","v":""},{"$f":"IF(ISERROR((SUM(B118:M118))/B4),\"\",(SUM(B118:M118))/B4)","v":0}]
[{"$f":"IF(ISERROR(Q!A19),\"\",Q!A19)","v":0},{"$f":"IFERROR(INDEX(April!E:E,MATCH(Year!A:A,April!A:A,0)),\"\")","v":""},{"$f":"IFERROR(INDEX(May!E:E,MATCH(Year!A:A,May!A:A,0)),\"\")","v":""},{"$f":"IFERROR(INDEX(June!E:E,MATCH(Year!A:A,June!A:A,0)),\"\")","v":""},{"$f":"IFERROR(INDEX(July!E:E,MATCH(Year!A:A,July!A:A,0)),\"\")","v":""},{"$f":"IFERROR(INDEX(Aug!E:E,MATCH(Year!A:A,Aug!A:A,0)),\"\")","v":""},{"$f":"IFERROR(INDEX(Sept!E:E,MATCH(Year!A:A,Sept!A:A,0)),\"\")","v":""},{"$f":"IFERROR(INDEX(Oct!E:E,MATCH(Year!A:A,Oct!A:A,0)),\"\")","v":""},{"$f":"IFERROR(INDEX(Nov!E:E,MATCH(Year!A:A,Nov!A:A,0)),\"\")","v":""},{"$f":"IFERROR(INDEX(Dec!E:E,MATCH(Year!A:A,Dec!A:A,0)),\"\")","v":""},{"$f":"IFERROR(INDEX(Jan!E:E,MATCH(Year!A:A,Jan!A:A,0)),\"\")","v":""},{"$f":"IFERROR(INDEX(Feb!E:E,MATCH(Year!A:A,Feb!A:A,0)),\"\")","v":""},{"$f":"IFERROR(INDEX(March!E:E,MATCH(Year!A:A,March!A:A,0)),\"\")","v":""},{"$f":"IF(ISERROR((SUM(B119:M119))/B4),\"\",(SUM(B119:M119))/B4)","v":0}]
[{"$f":"IF(ISERROR(Q!A20),\"\",Q!A20)","v":0},{"$f":"IFERROR(INDEX(April!E:E,MATCH(Year!A:A,April!A:A,0)),\"\")","v":""},{"$f":"IFERROR(INDEX(May!E:E,MATCH(Year!A:A,May!A:A,0)),\"\")","v":""},{"$f":"IFERROR(INDEX(June!E:E,MATCH(Year!A:A,June!A:A,0)),\"\")","v":""},{"$f":"IFERROR(INDEX(July!E:E,MATCH(Year!A:A,July!A:A,0)),\"\")","v":""},{"$f":"IFERROR(INDEX(Aug!E:E,MATCH(Year!A:A,Aug!A:A,0)),\"\")","v":""},{"$f":"IFERROR(INDEX(Sept!E:E,MATCH(Year!A:A,Sept!A:A,0)),\"\")","v":""},{"$f":"IFERROR(INDEX(Oct!E:E,MATCH(Year!A:A,Oct!A:A,0)),\"\")","v":""},{"$f":"IFERROR(INDEX(Nov!E:E,MATCH(Year!A:A,Nov!A:A,0)),\"\")","v":""},{"$f":"IFERROR(INDEX(Dec!E:E,MATCH(Year!A:A,Dec!A:A,0)),\"\")","v":""},{"$f":"IFERROR(INDEX(Jan!E:E,MATCH(Year!A:A,Jan!A:A,0)),\"\")","v":""},{"$f":"IFERROR(INDEX(Feb!E:E,MATCH(Year!A:A,Feb!A:A,0)),\"\")","v":""},{"$f":"IFERROR(INDEX(March!E:E,MATCH(Year!A:A,March!A:A,0)),\"\")","v":""},{"$f":"IF(ISERROR((SUM(B120:M120))/B4),\"\",(SUM(B120:M120))/B4)","v":0}]
[{"$f":"IF(ISERROR(Q!A21),\"\",Q!A21)","v":0},{"$f":"IFERROR(INDEX(April!E:E,MATCH(Year!A:A,April!A:A,0)),\"\")","v":""},{"$f":"IFERROR(INDEX(May!E:E,MATCH(Year!A:A,May!A:A,0)),\"\")","v":""},{"$f":"IFERROR(INDEX(June!E:E,MATCH(Year!A:A,June!A:A,0)),\"\")","v":""},{"$f":"IFERROR(INDEX(July!E:E,MATCH(Year!A:A,July!A:A,0)),\"\")","v":""},{"$f":"IFERROR(INDEX(Aug!E:E,MATCH(Year!A:A,Aug!A:A,0)),\"\")","v":""},{"$f":"IFERROR(INDEX(Sept!E:E,MATCH(Year!A:A,Sept!A:A,0)),\"\")","v":""},{"$f":"IFERROR(INDEX(Oct!E:E,MATCH(Year!A:A,Oct!A:A,0)),\"\")","v":""},{"$f":"IFERROR(INDEX(Nov!E:E,MATCH(Year!A:A,Nov!A:A,0)),\"\")","v":""},{"$f":"IFERROR(INDEX(Dec!E:E,MATCH(Year!A:A,Dec!A:A,0)),\"\")","v":""},{"$f":"IFERROR(INDEX(Jan!E:E,MATCH(Year!A:A,Jan!A:A,0)),\"\")","v":""},{"$f":"IFERROR(INDEX(Feb!E:E,MATCH(Year!A:A,Feb!A:A,0)),\"\")","v":""},{"$f":"IFERROR(INDEX(March!E:E,MATCH(Year!A:A,March!A:A,0)),\"\")","v":""},{"$f":"IF(ISERROR((SUM(B121:M121))/B4),\"\",(SUM(B121:M121))/B4)","v":0}]
[{"$f":"IF(ISERROR(Q!A22),\"\",Q!A22)","v":0},{"$f":"IFERROR(INDEX(April!E:E,MATCH(Year!A:A,April!A:A,0)),\"\")","v":""},{"$f":"IFERROR(INDEX(May!E:E,MATCH(Year!A:A,May!A:A,0)),\"\")","v":""},{"$f":"IFERROR(INDEX(June!E:E,MATCH(Year!A:A,June!A:A,0)),\"\")","v":""},{"$f":"IFERROR(INDEX(July!E:E,MATCH(Year!A:A,July!A:A,0)),\"\")","v":""},{"$f":"IFERROR(INDEX(Aug!E:E,MATCH(Year!A:A,Aug!A:A,0)),\"\")","v":""},{"$f":"IFERROR(INDEX(Sept!E:E,MATCH(Year!A:A,Sept!A:A,0)),\"\")","v":""},{"$f":"IFERROR(INDEX(Oct!E:E,MATCH(Year!A:A,Oct!A:A,0)),\"\")","v":""},{"$f":"IFERROR(INDEX(Nov!E:E,MATCH(Year!A:A,Nov!A:A,0)),\"\")","v":""},{"$f":"IFERROR(INDEX(Dec!E:E,MATCH(Year!A:A,Dec!A:A,0)),\"\")","v":""},{"$f":"IFERROR(INDEX(Jan!E:E,MATCH(Year!A:A,Jan!A:A,0)),\"\")","v":""},{"$f":"IFERROR(INDEX(Feb!E:E,MATCH(Year!A:A,Feb!A:A,0)),\"\")","v":""},{"$f":"IFERROR(INDEX(March!E:E,MATCH(Year!A:A,March!A:A,0)),\"\")","v":""},{"$f":"IF(ISERROR((SUM(B122:M122))/B4),\"\",(SUM(B122:M122))/B4)","v":0}]
[{"$f":"IF(ISERROR(Q!A23),\"\",Q!A23)","v":0},{"$f":"IFERROR(INDEX(April!E:E,MATCH(Year!A:A,April!A:A,0)),\"\")","v":""},{"$f":"IFERROR(INDEX(May!E:E,MATCH(Year!A:A,May!A:A,0)),\"\")","v":""},{"$f":"IFERROR(INDEX(June!E:E,MATCH(Year!A:A,June!A:A,0)),\"\")","v":""},{"$f":"IFERROR(INDEX(July!E:E,MATCH(Year!A:A,July!A:A,0)),\"\")","v":""},{"$f":"IFERROR(INDEX(Aug!E:E,MATCH(Year!A:A,Aug!A:A,0)),\"\")","v":""},{"$f":"IFERROR(INDEX(Sept!E:E,MATCH(Year!A:A,Sept!A:A,0)),\"\")","v":""},{"$f":"IFERROR(INDEX(Oct!E:E,MATCH(Year!A:A,Oct!A:A,0)),\"\")","v":""},{"$f":"IFERROR(INDEX(Nov!E:E,MATCH(Year!A:A,Nov!A:A,0)),\"\")","v":""},{"$f":"IFERROR(INDEX(Dec!E:E,MATCH(Year!A:A,Dec!A:A,0)),\"\")","v":""},{"$f":"IFERROR(INDEX(Jan!E:E,MATCH(Year!A:A,Jan!A:A,0)),\"\")","v":""},{"$f":"IFERROR(INDEX(Feb!E:E,MATCH(Year!A:A,Feb!A:A,0)),\"\")","v":""},{"$f":"IFERROR(INDEX(March!E:E,MATCH(Year!A:A,March!A:A,0)),\"\")","v":""},{"$f":"IF(ISERROR((SUM(B123:M123))/B4),\"\",(SUM(B123:M123))/B4)","v":0}]
[{"$f":"IF(ISERROR(Q!A24),\"\",Q!A24)","v":0},{"$f":"IFERROR(INDEX(April!E:E,MATCH(Year!A:A,April!A:A,0)),\"\")","v":""},{"$f":"IFERROR(INDEX(May!E:E,MATCH(Year!A:A,May!A:A,0)),\"\")","v":""},{"$f":"IFERROR(INDEX(June!E:E,MATCH(Year!A:A,June!A:A,0)),\"\")","v":""},{"$f":"IFERROR(INDEX(July!E:E,MATCH(Year!A:A,July!A:A,0)),\"\")","v":""},{"$f":"IFERROR(INDEX(Aug!E:E,MATCH(Year!A:A,Aug!A:A,0)),\"\")","v":""},{"$f":"IFERROR(INDEX(Sept!E:E,MATCH(Year!A:A,Sept!A:A,0)),\"\")","v":""},{"$f":"IFERROR(INDEX(Oct!E:E,MATCH(Year!A:A,Oct!A:A,0)),\"\")","v":""},{"$f":"IFERROR(INDEX(Nov!E:E,MATCH(Year!A:A,Nov!A:A,0)),\"\")","v":""},{"$f":"IFERROR(INDEX(Dec!E:E,MATCH(Year!A:A,Dec!A:A,0)),\"\")","v":""},{"$f":"IFERROR(INDEX(Jan!E:E,MATCH(Year!A:A,Jan!A:A,0)),\"\")","v":""},{"$f":"IFERROR(INDEX(Feb!E:E,MATCH(Year!A:A,Feb!A:A,0)),\"\")","v":""},{"$f":"IFERROR(INDEX(March!E:E,MATCH(Year!A:A,March!A:A,0)),\"\")","v":""},{"$f":"IF(ISERROR((SUM(B124:M124))/B4),\"\",(SUM(B124:M124))/B4)","v":0}]
[{"$f":"IF(ISERROR(Q!A25),\"\",Q!A25)","v":0},{"$f":"IFERROR(INDEX(April!E:E,MATCH(Year!A:A,April!A:A,0)),\"\")","v":""},{"$f":"IFERROR(INDEX(May!E:E,MATCH(Year!A:A,May!A:A,0)),\"\")","v":""},{"$f":"IFERROR(INDEX(June!E:E,MATCH(Year!A:A,June!A:A,0)),\"\")","v":""},{"$f":"IFERROR(INDEX(July!E:E,MATCH(Year!A:A,July!A:A,0)),\"\")","v":""},{"$f":"IFERROR(INDEX(Aug!E:E,MATCH(Year!A:A,Aug!A:A,0)),\"\")","v":""},{"$f":"IFERROR(INDEX(Sept!E:E,MATCH(Year!A:A,Sept!A:A,0)),\"\")","v":""},{"$f":"IFERROR(INDEX(Oct!E:E,MATCH(Year!A:A,Oct!A:A,0)),\"\")","v":""},{"$f":"IFERROR(INDEX(Nov!E:E,MATCH(Year!A:A,Nov!A:A,0)),\"\")","v":""},{"$f":"IFERROR(INDEX(Dec!E:E,MATCH(Year!A:A,Dec!A:A,0)),\"\")","v":""},{"$f":"IFERROR(INDEX(Jan!E:E,MATCH(Year!A:A,Jan!A:A,0)),\"\")","v":""},{"$f":"IFERROR(INDEX(Feb!E:E,MATCH(Year!A:A,Feb!A:A,0)),\"\")","v":""},{"$f":"IFERROR(INDEX(March!E:E,MATCH(Year!A:A,March!A:A,0)),\"\")","v":""},{"$f":"IF(ISERROR((SUM(B125:M125))/B4),\"\",(SUM(B125:M125))/B4)","v":0}]
[{"$f":"IF(ISERROR(Q!A26),\"\",Q!A26)","v":0},{"$f":"IFERROR(INDEX(April!E:E,MATCH(Year!A:A,April!A:A,0)),\"\")","v":""},{"$f":"IFERROR(INDEX(May!E:E,MATCH(Year!A:A,May!A:A,0)),\"\")","v":""},{"$f":"IFERROR(INDEX(June!E:E,MATCH(Year!A:A,June!A:A,0)),\"\")","v":""},{"$f":"IFERROR(INDEX(July!E:E,MATCH(Year!A:A,July!A:A,0)),\"\")","v":""},{"$f":"IFERROR(INDEX(Aug!E:E,MATCH(Year!A:A,Aug!A:A,0)),\"\")","v":""},{"$f":"IFERROR(INDEX(Sept!E:E,MATCH(Year!A:A,Sept!A:A,0)),\"\")","v":""},{"$f":"IFERROR(INDEX(Oct!E:E,MATCH(Year!A:A,Oct!A:A,0)),\"\")","v":""},{"$f":"IFERROR(INDEX(Nov!E:E,MATCH(Year!A:A,Nov!A:A,0)),\"\")","v":""},{"$f":"IFERROR(INDEX(Dec!E:E,MATCH(Year!A:A,Dec!A:A,0)),\"\")","v":""},{"$f":"IFERROR(INDEX(Jan!E:E,MATCH(Year!A:A,Jan!A:A,0)),\"\")","v":""},{"$f":"IFERROR(INDEX(Feb!E:E,MATCH(Year!A:A,Feb!A:A,0)),\"\")","v":""},{"$f":"IFERROR(INDEX(March!E:E,MATCH(Year!A:A,March!A:A,0)),\"\")","v":""},{"$f":"IF(ISERROR((SUM(B126:M126))/B4),\"\",(SUM(B126:M126))/B4)","v":0}]
[{"$f":"IF(ISERROR(Q!A27),\"\",Q!A27)","v":0},{"$f":"IFERROR(INDEX(April!E:E,MATCH(Year!A:A,April!A:A,0)),\"\")","v":""},{"$f":"IFERROR(INDEX(May!E:E,MATCH(Year!A:A,May!A:A,0)),\"\")","v":""},{"$f":"IFERROR(INDEX(June!E:E,MATCH(Year!A:A,June!A:A,0)),\"\")","v":""},{"$f":"IFERROR(INDEX(July!E:E,MATCH(Year!A:A,July!A:A,0)),\"\")","v":""},{"$f":"IFERROR(INDEX(Aug!E:E,MATCH(Year!A:A,Aug!A:A,0)),\"\")","v":""},{"$f":"IFERROR(INDEX(Sept!E:E,MATCH(Year!A:A,Sept!A:A,0)),\"\")","v":""},{"$f":"IFERROR(INDEX(Oct!E:E,MATCH(Year!A:A,Oct!A:A,0)),\"\")","v":""},{"$f":"IFERROR(INDEX(Nov!E:E,MATCH(Year!A:A,Nov!A:A,0)),\"\")","v":""},{"$f":"IFERROR(INDEX(Dec!E:E,MATCH(Year!A:A,Dec!A:A,0)),\"\")","v":""},{"$f":"IFERROR(INDEX(Jan!E:E,MATCH(Year!A:A,Jan!A:A,0)),\"\")","v":""},{"$f":"IFERROR(INDEX(Feb!E:E,MATCH(Year!A:A,Feb!A:A,0)),\"\")","v":""},{"$f":"IFERROR(INDEX(March!E:E,MATCH(Year!A:A,March!A:A,0)),\"\")","v":""},{"$f":"IF(ISERROR((SUM(B127:M127))/B4),\"\",(SUM(B127:M127))/B4)","v":0}]
[{"$f":"IF(ISERROR(Q!A28),\"\",Q!A28)","v":0},{"$f":"IFERROR(INDEX(April!E:E,MATCH(Year!A:A,April!A:A,0)),\"\")","v":""},{"$f":"IFERROR(INDEX(May!E:E,MATCH(Year!A:A,May!A:A,0)),\"\")","v":""},{"$f":"IFERROR(INDEX(June!E:E,MATCH(Year!A:A,June!A:A,0)),\"\")","v":""},{"$f":"IFERROR(INDEX(July!E:E,MATCH(Year!A:A,July!A:A,0)),\"\")","v":""},{"$f":"IFERROR(INDEX(Aug!E:E,MATCH(Year!A:A,Aug!A:A,0)),\"\")","v":""},{"$f":"IFERROR(INDEX(Sept!E:E,MATCH(Year!A:A,Sept!A:A,0)),\"\")","v":""},{"$f":"IFERROR(INDEX(Oct!E:E,MATCH(Year!A:A,Oct!A:A,0)),\"\")","v":""},{"$f":"IFERROR(INDEX(Nov!E:E,MATCH(Year!A:A,Nov!A:A,0)),\"\")","v":""},{"$f":"IFERROR(INDEX(Dec!E:E,MATCH(Year!A:A,Dec!A:A,0)),\"\")","v":""},{"$f":"IFERROR(INDEX(Jan!E:E,MATCH(Year!A:A,Jan!A:A,0)),\"\")","v":""},{"$f":"IFERROR(INDEX(Feb!E:E,MATCH(Year!A:A,Feb!A:A,0)),\"\")","v":""},{"$f":"IFERROR(INDEX(March!E:E,MATCH(Year!A:A,March!A:A,0)),\"\")","v":""},{"$f":"IF(ISERROR((SUM(B128:M128))/B4),\"\",(SUM(B128:M128))/B4)","v":0}]
[{"$f":"IF(ISERROR(Q!A29),\"\",Q!A29)","v":0},{"$f":"IFERROR(INDEX(April!E:E,MATCH(Year!A:A,April!A:A,0)),\"\")","v":""},{"$f":"IFERROR(INDEX(May!E:E,MATCH(Year!A:A,May!A:A,0)),\"\")","v":""},{"$f":"IFERROR(INDEX(June!E:E,MATCH(Year!A:A,June!A:A,0)),\"\")","v":""},{"$f":"IFERROR(INDEX(July!E:E,MATCH(Year!A:A,July!A:A,0)),\"\")","v":""},{"$f":"IFERROR(INDEX(Aug!E:E,MATCH(Year!A:A,Aug!A:A,0)),\"\")","v":""},{"$f":"IFERROR(INDEX(Sept!E:E,MATCH(Year!A:A,Sept!A:A,0)),\"\")","v":""},{"$f":"IFERROR(INDEX(Oct!E:E,MATCH(Year!A:A,Oct!A:A,0)),\"\")","v":""},{"$f":"IFERROR(INDEX(Nov!E:E,MATCH(Year!A:A,Nov!A:A,0)),\"\")","v":""},{"$f":"IFERROR(INDEX(Dec!E:E,MATCH(Year!A:A,Dec!A:A,0)),\"\")","v":""},{"$f":"IFERROR(INDEX(Jan!E:E,MATCH(Year!A:A,Jan!A:A,0)),\"\")","v":""},{"$f":"IFERROR(INDEX(Feb!E:E,MATCH(Year!A:A,Feb!A:A,0)),\"\")","v":""},{"$f":"IFERROR(INDEX(March!E:E,MATCH(Year!A:A,March!A:A,0)),\"\")","v":""},{"$f":"IF(ISERROR((SUM(B129:M129))/B4),\"\",(SUM(B129:M129))/B4)","v":0}]
[{"$f":"IF(ISERROR(Q!A30),\"\",Q!A30)","v":0},{"$f":"IFERROR(INDEX(April!E:E,MATCH(Year!A:A,April!A:A,0)),\"\")","v":""},{"$f":"IFERROR(INDEX(May!E:E,MATCH(Year!A:A,May!A:A,0)),\"\")","v":""},{"$f":"IFERROR(INDEX(June!E:E,MATCH(Year!A:A,June!A:A,0)),\"\")","v":""},{"$f":"IFERROR(INDEX(July!E:E,MATCH(Year!A:A,July!A:A,0)),\"\")","v":""},{"$f":"IFERROR(INDEX(Aug!E:E,MATCH(Year!A:A,Aug!A:A,0)),\"\")","v":""},{"$f":"IFERROR(INDEX(Sept!E:E,MATCH(Year!A:A,Sept!A:A,0)),\"\")","v":""},{"$f":"IFERROR(INDEX(Oct!E:E,MATCH(Year!A:A,Oct!A:A,0)),\"\")","v":""},{"$f":"IFERROR(INDEX(Nov!E:E,MATCH(Year!A:A,Nov!A:A,0)),\"\")","v":""},{"$f":"IFERROR(INDEX(Dec!E:E,MATCH(Year!A:A,Dec!A:A,0)),\"\")","v":""},{"$f":"IFERROR(INDEX(Jan!E:E,MATCH(Year!A:A,Jan!A:A,0)),\"\")","v":""},{"$f":"IFERROR(INDEX(Feb!E:E,MATCH(Year!A:A,Feb!A:A,0)),\"\")","v":""},{"$f":"IFERROR(INDEX(March!E:E,MATCH(Year!A:A,March!A:A,0)),\"\")","v":""},{"$f":"IF(ISERROR((SUM(B130:M130))/B4),\"\",(SUM(B130:M130))/B4)","v":0}]
[{"$f":"IF(ISERROR(Q!A31),\"\",Q!A31)","v":0},{"$f":"IFERROR(INDEX(April!E:E,MATCH(Year!A:A,April!A:A,0)),\"\")","v":""},{"$f":"IFERROR(INDEX(May!E:E,MATCH(Year!A:A,May!A:A,0)),\"\")","v":""},{"$f":"IFERROR(INDEX(June!E:E,MATCH(Year!A:A,June!A:A,0)),\"\")","v":""},{"$f":"IFERROR(INDEX(July!E:E,MATCH(Year!A:A,July!A:A,0)),\"\")","v":""},{"$f":"IFERROR(INDEX(Aug!E:E,MATCH(Year!A:A,Aug!A:A,0)),\"\")","v":""},{"$f":"IFERROR(INDEX(Sept!E:E,MATCH(Year!A:A,Sept!A:A,0)),\"\")","v":""},{"$f":"IFERROR(INDEX(Oct!E:E,MATCH(Year!A:A,Oct!A:A,0)),\"\")","v":""},{"$f":"IFERROR(INDEX(Nov!E:E,MATCH(Year!A:A,Nov!A:A,0)),\"\")","v":""},{"$f":"IFERROR(INDEX(Dec!E:E,MATCH(Year!A:A,Dec!A:A,0)),\"\")","v":""},{"$f":"IFERROR(INDEX(Jan!E:E,MATCH(Year!A:A,Jan!A:A,0)),\"\")","v":""},{"$f":"IFERROR(INDEX(Feb!E:E,MATCH(Year!A:A,Feb!A:A,0)),\"\")","v":""},{"$f":"IFERROR(INDEX(March!E:E,MATCH(Year!A:A,March!A:A,0)),\"\")","v":""},{"$f":"IF(ISERROR((SUM(B131:M131))/B4),\"\",(SUM(B131:M131))/B4)","v":0}]
[{"$f":"IF(ISERROR(Q!A32),\"\",Q!A32)","v":0},{"$f":"IFERROR(INDEX(April!E:E,MATCH(Year!A:A,April!A:A,0)),\"\")","v":""},{"$f":"IFERROR(INDEX(May!E:E,MATCH(Year!A:A,May!A:A,0)),\"\")","v":""},{"$f":"IFERROR(INDEX(June!E:E,MATCH(Year!A:A,June!A:A,0)),\"\")","v":""},{"$f":"IFERROR(INDEX(July!E:E,MATCH(Year!A:A,July!A:A,0)),\"\")","v":""},{"$f":"IFERROR(INDEX(Aug!E:E,MATCH(Year!A:A,Aug!A:A,0)),\"\")","v":""},{"$f":"IFERROR(INDEX(Sept!E:E,MATCH(Year!A:A,Sept!A:A,0)),\"\")","v":""},{"$f":"IFERROR(INDEX(Oct!E:E,MATCH(Year!A:A,Oct!A:A,0)),\"\")","v":""},{"$f":"IFERROR(INDEX(Nov!E:E,MATCH(Year!A:A,Nov!A:A,0)),\"\")","v":""},{"$f":"IFERROR(INDEX(Dec!E:E,MATCH(Year!A:A,Dec!A:A,0)),\"\")","v":""},{"$f":"IFERROR(INDEX(Jan!E:E,MATCH(Year!A:A,Jan!A:A,0)),\"\")","v":""},{"$f":"IFERROR(INDEX(Feb!E:E,MATCH(Year!A:A,Feb!A:A,0)),\"\")","v":""},{"$f":"IFERROR(INDEX(March!E:E,MATCH(Year!A:A,March!A:A,0)),\"\")","v":""},{"$f":"IF(ISERROR((SUM(B132:M132))/B4),\"\",(SUM(B132:M132))/B4)","v":0}]
[{"$f":"IF(ISERROR(Q!A33),\"\",Q!A33)","v":0},{"$f":"IFERROR(INDEX(April!E:E,MATCH(Year!A:A,April!A:A,0)),\"\")","v":""},{"$f":"IFERROR(INDEX(May!E:E,MATCH(Year!A:A,May!A:A,0)),\"\")","v":""},{"$f":"IFERROR(INDEX(June!E:E,MATCH(Year!A:A,June!A:A,0)),\"\")","v":""},{"$f":"IFERROR(INDEX(July!E:E,MATCH(Year!A:A,July!A:A,0)),\"\")","v":""},{"$f":"IFERROR(INDEX(Aug!E:E,MATCH(Year!A:A,Aug!A:A,0)),\"\")","v":""},{"$f":"IFERROR(INDEX(Sept!E:E,MATCH(Year!A:A,Sept!A:A,0)),\"\")","v":""},{"$f":"IFERROR(INDEX(Oct!E:E,MATCH(Year!A:A,Oct!A:A,0)),\"\")","v":""},{"$f":"IFERROR(INDEX(Nov!E:E,MATCH(Year!A:A,Nov!A:A,0)),\"\")","v":""},{"$f":"IFERROR(INDEX(Dec!E:E,MATCH(Year!A:A,Dec!A:A,0)),\"\")","v":""},{"$f":"IFERROR(INDEX(Jan!E:E,MATCH(Year!A:A,Jan!A:A,0)),\"\")","v":""},{"$f":"IFERROR(INDEX(Feb!E:E,MATCH(Year!A:A,Feb!A:A,0)),\"\")","v":""},{"$f":"IFERROR(INDEX(March!E:E,MATCH(Year!A:A,March!A:A,0)),\"\")","v":""},{"$f":"IF(ISERROR((SUM(B133:M133))/B4),\"\",(SUM(B133:M133))/B4)","v":0}]
[{"$f":"IF(ISERROR(Q!A34),\"\",Q!A34)","v":0},{"$f":"IFERROR(INDEX(April!E:E,MATCH(Year!A:A,April!A:A,0)),\"\")","v":""},{"$f":"IFERROR(INDEX(May!E:E,MATCH(Year!A:A,May!A:A,0)),\"\")","v":""},{"$f":"IFERROR(INDEX(June!E:E,MATCH(Year!A:A,June!A:A,0)),\"\")","v":""},{"$f":"IFERROR(INDEX(July!E:E,MATCH(Year!A:A,July!A:A,0)),\"\")","v":""},{"$f":"IFERROR(INDEX(Aug!E:E,MATCH(Year!A:A,Aug!A:A,0)),\"\")","v":""},{"$f":"IFERROR(INDEX(Sept!E:E,MATCH(Year!A:A,Sept!A:A,0)),\"\")","v":""},{"$f":"IFERROR(INDEX(Oct!E:E,MATCH(Year!A:A,Oct!A:A,0)),\"\")","v":""},{"$f":"IFERROR(INDEX(Nov!E:E,MATCH(Year!A:A,Nov!A:A,0)),\"\")","v":""},{"$f":"IFERROR(INDEX(Dec!E:E,MATCH(Year!A:A,Dec!A:A,0)),\"\")","v":""},{"$f":"IFERROR(INDEX(Jan!E:E,MATCH(Year!A:A,Jan!A:A,0)),\"\")","v":""},{"$f":"IFERROR(INDEX(Feb!E:E,MATCH(Year!A:A,Feb!A:A,0)),\"\")","v":""},{"$f":"IFERROR(INDEX(March!E:E,MATCH(Year!A:A,March!A:A,0)),\"\")","v":""},{"$f":"IF(ISERROR((SUM(B134:M134))/B4),\"\",(SUM(B134:M134))/B4)","v":0}]
[{"$f":"IF(ISERROR(Q!A35),\"\",Q!A35)","v":0},{"$f":"IFERROR(INDEX(April!E:E,MATCH(Year!A:A,April!A:A,0)),\"\")","v":""},{"$f":"IFERROR(INDEX(May!E:E,MATCH(Year!A:A,May!A:A,0)),\"\")","v":""},{"$f":"IFERROR(INDEX(June!E:E,MATCH(Year!A:A,June!A:A,0)),\"\")","v":""},{"$f":"IFERROR(INDEX(July!E:E,MATCH(Year!A:A,July!A:A,0)),\"\")","v":""},{"$f":"IFERROR(INDEX(Aug!E:E,MATCH(Year!A:A,Aug!A:A,0)),\"\")","v":""},{"$f":"IFERROR(INDEX(Sept!E:E,MATCH(Year!A:A,Sept!A:A,0)),\"\")","v":""},{"$f":"IFERROR(INDEX(Oct!E:E,MATCH(Year!A:A,Oct!A:A,0)),\"\")","v":""},{"$f":"IFERROR(INDEX(Nov!E:E,MATCH(Year!A:A,Nov!A:A,0)),\"\")","v":""},{"$f":"IFERROR(INDEX(Dec!E:E,MATCH(Year!A:A,Dec!A:A,0)),\"\")","v":""},{"$f":"IFERROR(INDEX(Jan!E:E,MATCH(Year!A:A,Jan!A:A,0)),\"\")","v":""},{"$f":"IFERROR(INDEX(Feb!E:E,MATCH(Year!A:A,Feb!A:A,0)),\"\")","v":""},{"$f":"IFERROR(INDEX(March!E:E,MATCH(Year!A:A,March!A:A,0)),\"\")","v":""},{"$f":"IF(ISERROR((SUM(B135:M135))/B4),\"\",(SUM(B135:M135))/B4)","v":0}]
[{"$f":"IF(ISERROR(Q!A36),\"\",Q!A36)","v":0},{"$f":"IFERROR(INDEX(April!E:E,MATCH(Year!A:A,April!A:A,0)),\"\")","v":""},{"$f":"IFERROR(INDEX(May!E:E,MATCH(Year!A:A,May!A:A,0)),\"\")","v":""},{"$f":"IFERROR(INDEX(June!E:E,MATCH(Year!A:A,June!A:A,0)),\"\")","v":""},{"$f":"IFERROR(INDEX(July!E:E,MATCH(Year!A:A,July!A:A,0)),\"\")","v":""},{"$f":"IFERROR(INDEX(Aug!E:E,MATCH(Year!A:A,Aug!A:A,0)),\"\")","v":""},{"$f":"IFERROR(INDEX(Sept!E:E,MATCH(Year!A:A,Sept!A:A,0)),\"\")","v":""},{"$f":"IFERROR(INDEX(Oct!E:E,MATCH(Year!A:A,Oct!A:A,0)),\"\")","v":""},{"$f":"IFERROR(INDEX(Nov!E:E,MATCH(Year!A:A,Nov!A:A,0)),\"\")","v":""},{"$f":"IFERROR(INDEX(Dec!E:E,MATCH(Year!A:A,Dec!A:A,0)),\"\")","v":""},{"$f":"IFERROR(INDEX(Jan!E:E,MATCH(Year!A:A,Jan!A:A,0)),\"\")","v":""},{"$f":"IFERROR(INDEX(Feb!E:E,MATCH(Year!A:A,Feb!A:A,0)),\"\")","v":""},{"$f":"IFERROR(INDEX(March!E:E,MATCH(Year!A:A,March!A:A,0)),\"\")","v":""},{"$f":"IF(ISERROR((SUM(B136:M136))/B4),\"\",(SUM(B136:M136))/B4)","v":0}]
[{"$f":"IF(ISERROR(Q!A37),\"\",Q!A37)","v":0},{"$f":"IFERROR(INDEX(April!E:E,MATCH(Year!A:A,April!A:A,0)),\"\")","v":""},{"$f":"IFERROR(INDEX(May!E:E,MATCH(Year!A:A,May!A:A,0)),\"\")","v":""},{"$f":"IFERROR(INDEX(June!E:E,MATCH(Year!A:A,June!A:A,0)),\"\")","v":""},{"$f":"IFERROR(INDEX(July!E:E,MATCH(Year!A:A,July!A:A,0)),\"\")","v":""},{"$f":"IFERROR(INDEX(Aug!E:E,MATCH(Year!A:A,Aug!A:A,0)),\"\")","v":""},{"$f":"IFERROR(INDEX(Sept!E:E,MATCH(Year!A:A,Sept!A:A,0)),\"\")","v":""},{"$f":"IFERROR(INDEX(Oct!E:E,MATCH(Year!A:A,Oct!A:A,0)),\"\")","v":""},{"$f":"IFERROR(INDEX(Nov!E:E,MATCH(Year!A:A,Nov!A:A,0)),\"\")","v":""},{"$f":"IFERROR(INDEX(Dec!E:E,MATCH(Year!A:A,Dec!A:A,0)),\"\")","v":""},{"$f":"IFERROR(INDEX(Jan!E:E,MATCH(Year!A:A,Jan!A:A,0)),\"\")","v":""},{"$f":"IFERROR(INDEX(Feb!E:E,MATCH(Year!A:A,Feb!A:A,0)),\"\")","v":""},{"$f":"IFERROR(INDEX(March!E:E,MATCH(Year!A:A,March!A:A,0)),\"\")","v":""},{"$f":"IF(ISERROR((SUM(B137:M137))/B4),\"\",(SUM(B137:M137))/B4)","v":0}]
[{"$f":"IF(ISERROR(Q!A38),\"\",Q!A38)","v":0},{"$f":"IFERROR(INDEX(April!E:E,MATCH(Year!A:A,April!A:A,0)),\"\")","v":""},{"$f":"IFERROR(INDEX(May!E:E,MATCH(Year!A:A,May!A:A,0)),\"\")","v":""},{"$f":"IFERROR(INDEX(June!E:E,MATCH(Year!A:A,June!A:A,0)),\"\")","v":""},{"$f":"IFERROR(INDEX(July!E:E,MATCH(Year!A:A,July!A:A,0)),\"\")","v":""},{"$f":"IFERROR(INDEX(Aug!E:E,MATCH(Year!A:A,Aug!A:A,0)),\"\")","v":""},{"$f":"IFERROR(INDEX(Sept!E:E,MATCH(Year!A:A,Sept!A:A,0)),\"\")","v":""},{"$f":"IFERROR(INDEX(Oct!E:E,MATCH(Year!A:A,Oct!A:A,0)),\"\")","v":""},{"$f":"IFERROR(INDEX(Nov!E:E,MATCH(Year!A:A,Nov!A:A,0)),\"\")","v":""},{"$f":"IFERROR(INDEX(Dec!E:E,MATCH(Year!A:A,Dec!A:A,0)),\"\")","v":""},{"$f":"IFERROR(INDEX(Jan!E:E,MATCH(Year!A:A,Jan!A:A,0)),\"\")","v":""},{"$f":"IFERROR(INDEX(Feb!E:E,MATCH(Year!A:A,Feb!A:A,0)),\"\")","v":""},{"$f":"IFERROR(INDEX(March!E:E,MATCH(Year!A:A,March!A:A,0)),\"\")","v":""},{"$f":"IF(ISERROR((SUM(B138:M138))/B4),\"\",(SUM(B138:M138))/B4)","v":0}]
[{"$f":"IF(ISERROR(Q!A39),\"\",Q!A39)","v":0},{"$f":"IFERROR(INDEX(April!E:E,MATCH(Year!A:A,April!A:A,0)),\"\")","v":""},{"$f":"IFERROR(INDEX(May!E:E,MATCH(Year!A:A,May!A:A,0)),\"\")","v":""},{"$f":"IFERROR(INDEX(June!E:E,MATCH(Year!A:A,June!A:A,0)),\"\")","v":""},{"$f":"IFERROR(INDEX(July!E:E,MATCH(Year!A:A,July!A:A,0)),\"\")","v":""},{"$f":"IFERROR(INDEX(Aug!E:E,MATCH(Year!A:A,Aug!A:A,0)),\"\")","v":""},{"$f":"IFERROR(INDEX(Sept!E:E,MATCH(Year!A:A,Sept!A:A,0)),\"\")","v":""},{"$f":"IFERROR(INDEX(Oct!E:E,MATCH(Year!A:A,Oct!A:A,0)),\"\")","v":""},{"$f":"IFERROR(INDEX(Nov!E:E,MATCH(Year!A:A,Nov!A:A,0)),\"\")","v":""},{"$f":"IFERROR(INDEX(Dec!E:E,MATCH(Year!A:A,Dec!A:A,0)),\"\")","v":""},{"$f":"IFERROR(INDEX(Jan!E:E,MATCH(Year!A:A,Jan!A:A,0)),\"\")","v":""},{"$f":"IFERROR(INDEX(Feb!E:E,MATCH(Year!A:A,Feb!A:A,0)),\"\")","v":""},{"$f":"IFERROR(INDEX(March!E:E,MATCH(Year!A:A,March!A:A,0)),\"\")","v":""},{"$f":"IF(ISERROR((SUM(B139:M139))/B4),\"\",(SUM(B139:M139))/B4)","v":0}]
[{"$f":"IF(ISERROR(Q!A40),\"\",Q!A40)","v":0},{"$f":"IFERROR(INDEX(April!E:E,MATCH(Year!A:A,April!A:A,0)),\"\")","v":""},{"$f":"IFERROR(INDEX(May!E:E,MATCH(Year!A:A,May!A:A,0)),\"\")","v":""},{"$f":"IFERROR(INDEX(June!E:E,MATCH(Year!A:A,June!A:A,0)),\"\")","v":""},{"$f":"IFERROR(INDEX(July!E:E,MATCH(Year!A:A,July!A:A,0)),\"\")","v":""},{"$f":"IFERROR(INDEX(Aug!E:E,MATCH(Year!A:A,Aug!A:A,0)),\"\")","v":""},{"$f":"IFERROR(INDEX(Sept!E:E,MATCH(Year!A:A,Sept!A:A,0)),\"\")","v":""},{"$f":"IFERROR(INDEX(Oct!E:E,MATCH(Year!A:A,Oct!A:A,0)),\"\")","v":""},{"$f":"IFERROR(INDEX(Nov!E:E,MATCH(Year!A:A,Nov!A:A,0)),\"\")","v":""},{"$f":"IFERROR(INDEX(Dec!E:E,MATCH(Year!A:A,Dec!A:A,0)),\"\")","v":""},{"$f":"IFERROR(INDEX(Jan!E:E,MATCH(Year!A:A,Jan!A:A,0)),\"\")","v":""},{"$f":"IFERROR(INDEX(Feb!E:E,MATCH(Year!A:A,Feb!A:A,0)),\"\")","v":""},{"$f":"IFERROR(INDEX(March!E:E,MATCH(Year!A:A,March!A:A,0)),\"\")","v":""},{"$f":"IF(ISERROR((SUM(B140:M140))/B4),\"\",(SUM(B140:M140))/B4)","v":0}]
[{"$f":"IF(ISERROR(Q!A41),\"\",Q!A41)","v":0},{"$f":"IFERROR(INDEX(April!E:E,MATCH(Year!A:A,April!A:A,0)),\"\")","v":""},{"$f":"IFERROR(INDEX(May!E:E,MATCH(Year!A:A,May!A:A,0)),\"\")","v":""},{"$f":"IFERROR(INDEX(June!E:E,MATCH(Year!A:A,June!A:A,0)),\"\")","v":""},{"$f":"IFERROR(INDEX(July!E:E,MATCH(Year!A:A,July!A:A,0)),\"\")","v":""},{"$f":"IFERROR(INDEX(Aug!E:E,MATCH(Year!A:A,Aug!A:A,0)),\"\")","v":""},{"$f":"IFERROR(INDEX(Sept!E:E,MATCH(Year!A:A,Sept!A:A,0)),\"\")","v":""},{"$f":"IFERROR(INDEX(Oct!E:E,MATCH(Year!A:A,Oct!A:A,0)),\"\")","v":""},{"$f":"IFERROR(INDEX(Nov!E:E,MATCH(Year!A:A,Nov!A:A,0)),\"\")","v":""},{"$f":"IFERROR(INDEX(Dec!E:E,MATCH(Year!A:A,Dec!A:A,0)),\"\")","v":""},{"$f":"IFERROR(INDEX(Jan!E:E,MATCH(Year!A:A,Jan!A:A,0)),\"\")","v":""},{"$f":"IFERROR(INDEX(Feb!E:E,MATCH(Year!A:A,Feb!A:A,0)),\"\")","v":""},{"$f":"IFERROR(INDEX(March!E:E,MATCH(Year!A:A,March!A:A,0)),\"\")","v":""},{"$f":"IF(ISERROR((SUM(B141:M141))/B4),\"\",(SUM(B141:M141))/B4)","v":0}]
["Average",{"$f":"IF(ISERROR((SUM(B102:B141)/April!B8)),\"\",(SUM(B102:B141)/April!B8))","v":7.2727272727272738E-2},{"$f":"IF(ISERROR((SUM(B102:B141)/May!B8)),\"\",(SUM(B102:B141)/May!B8))","v":7.2727272727272738E-2},{"$f":"IF(ISERROR((SUM(B102:B141)/June!B8)),\"\",(SUM(B102:B141)/June!B8))","v":7.2727272727272738E-2},{"$f":"IF(ISERROR((SUM(B102:B141)/July!B8)),\"\",(SUM(B102:B141)/July!B8))","v":7.2727272727272738E-2},{"$f":"IF(ISERROR((SUM(B102:B141)/Aug!B8)),\"\",(SUM(B102:B141)/Aug!B8))","v":7.2727272727272738E-2},{"$f":"IF(ISERROR((SUM(B102:B141)/Sept!B8)),\"\",(SUM(B102:B141)/Sept!B8))","v":7.2727272727272738E-2},{"$f":"IF(ISERROR((SUM(B102:B141)/Oct!B8)),\"\",(SUM(B102:B141)/Oct!B8))","v":7.2727272727272738E-2},{"$f":"IF(ISERROR((SUM(B102:B141)/Nov!B8)),\"\",(SUM(B102:B141)/Nov!B8))","v":7.2727272727272738E-2},{"$f":"IF(ISERROR((SUM(B102:B141)/Dec!B8)),\"\",(SUM(B102:B141)/Dec!B8))","v":7.2727272727272738E-2},{"$f":"IF(ISERROR((SUM(B102:B141)/Jan!B8)),\"\",(SUM(B102:B141)/Jan!B8))","v":7.2727272727272738E-2},{"$f":"IF(ISERROR((SUM(B102:B141)/Feb!B8)),\"\",(SUM(B102:B141)/Feb!B8))","v":7.2727272727272738E-2},{"$f":"IF(ISERROR((SUM(B102:B141)/March!B8)),\"\",(SUM(B102:B141)/March!B8))","v":7.2727272727272738E-2}]
[]
["Not Compliant"]
["Metric","April","May","June","July","August","September","October","November","December","January","February","March","Year average"]
[{"$f":"IF(ISERROR(Q!A2),\"\",Q!A2)","v":"Was a Room number documented?"},{"$f":"IFERROR(INDEX(April!F:F,MATCH(Year!A:A,April!A:A,0)),\"\")","v":0},{"$f":"IFERROR(INDEX(May!F:F,MATCH(Year!A:A,May!A:A,0)),\"\")","v":0},{"$f":"IFERROR(INDEX(June!F:F,MATCH(Year!A:A,June!A:A,0)),\"\")","v":0},{"$f":"IFERROR(INDEX(July!F:F,MATCH(Year!A:A,July!A:A,0)),\"\")","v":0},{"$f":"IFERROR(INDEX(Aug!F:F,MATCH(Year!A:A,Aug!A:A,0)),\"\")","v":0},{"$f":"IFERROR(INDEX(Sept!F:F,MATCH(Year!A:A,Sept!A:A,0)),\"\")","v":0},{"$f":"IFERROR(INDEX(Oct!F:F,MATCH(Year!A:A,Oct!A:A,0)),\"\")","v":0},{"$f":"IFERROR(INDEX(Nov!F:F,MATCH(Year!A:A,Nov!A:A,0)),\"\")","v":0},{"$f":"IFERROR(INDEX(Dec!F:F,MATCH(Year!A:A,Dec!A:A,0)),\"\")","v":0},{"$f":"IFERROR(INDEX(Jan!F:F,MATCH(Year!A:A,Jan!A:A,0)),\"\")","v":0},{"$f":"IFERROR(INDEX(Feb!F:F,MATCH(Year!A:A,Feb!A:A,0)),\"\")","v":0.2},{"$f":"IFERROR(INDEX(March!F:F,MATCH(Year!A:A,March!A:A,0)),\"\")","v":0},{"$f":"IF(ISERROR((SUM(B146:M146))/B4),\"\",(SUM(B146:M146))/B4)","v":1.6666666666666666E-2}]
[{"$f":"IF(ISERROR(Q!A3),\"\",Q!A3)","v":"Were stage A checks completed as appropriate?"},{"$f":"IFERROR(INDEX(April!F:F,MATCH(Year!A:A,April!A:A,0)),\"\")","v":0},{"$f":"IFERROR(INDEX(May!F:F,MATCH(Year!A:A,May!A:A,0)),\"\")","v":0.25},{"$f":"IFERROR(INDEX(June!F:F,MATCH(Year!A:A,June!A:A,0)),\"\")","v":0},{"$f":"IFERROR(INDEX(July!F:F,MATCH(Year!A:A,July!A:A,0)),\"\")","v":0},{"$f":"IFERROR(INDEX(Aug!F:F,MATCH(Year!A:A,Aug!A:A,0)),\"\")","v":0.2},{"$f":"IFERROR(INDEX(Sept!F:F,MATCH(Year!A:A,Sept!A:A,0)),\"\")","v":0},{"$f":"IFERROR(INDEX(Oct!F:F,MATCH(Year!A:A,Oct!A:A,0)),\"\")","v":0},{"$f":"IFERROR(INDEX(Nov!F:F,MATCH(Year!A:A,Nov!A:A,0)),\"\")","v":0},{"$f":"IFERROR(INDEX(Dec!F:F,MATCH(Year!A:A,Dec!A:A,0)),\"\")","v":0},{"$f":"IFERROR(INDEX(Jan!F:F,MATCH(Year!A:A,Jan!A:A,0)),\"\")","v":0.16666666666666666},{"$f":"IFERROR(INDEX(Feb!F:F,MATCH(Year!A:A,Feb!A:A,0)),\"\")","v":0.25},{"$f":"IFERROR(INDEX(March!F:F,MATCH(Year!A:A,March!A:A,0)),\"\")","v":0},{"$f":"IF(ISERROR((SUM(B147:M147))/B4),\"\",(SUM(B147:M147))/B4)","v":7.2222222222222229E-2}]
[{"$f":"IF(ISERROR(Q!A4),\"\",Q!A4)","v":"Was COSI Part 1 performed?"},{"$f":"IFERROR(INDEX(April!F:F,MATCH(Year!A:A,April!A:A,0)),\"\")","v":0.4},{"$f":"IFERROR(INDEX(May!F:F,MATCH(Year!A:A,May!A:A,0)),\"\")","v":0.5},{"$f":"IFERROR(INDEX(June!F:F,MATCH(Year!A:A,June!A:A,0)),\"\")","v":0.2},{"$f":"IFERROR(INDEX(July!F:F,MATCH(Year!A:A,July!A:A,0)),\"\")","v":0.2},{"$f":"IFERROR(INDEX(Aug!F:F,MATCH(Year!A:A,Aug!A:A,0)),\"\")","v":0},{"$f":"IFERROR(INDEX(Sept!F:F,MATCH(Year!A:A,Sept!A:A,0)),\"\")","v":0.25},{"$f":"IFERROR(INDEX(Oct!F:F,MATCH(Year!A:A,Oct!A:A,0)),\"\")","v":0},{"$f":"IFERROR(INDEX(Nov!F:F,MATCH(Year!A:A,Nov!A:A,0)),\"\")","v":0},{"$f":"IFERROR(INDEX(Dec!F:F,MATCH(Year!A:A,Dec!A:A,0)),\"\")","v":0.4},{"$f":"IFERROR(INDEX(Jan!F:F,MATCH(Year!A:A,Jan!A:A,0)),\"\")","v":0.16666666666666666},{"$f":"IFERROR(INDEX(Feb!F:F,MATCH(Year!A:A,Feb!A:A,0)),\"\")","v":0},{"$f":"IFERROR(INDEX(March!F:F,MATCH(Year!A:A,March!A:A,0)),\"\")","v":0.33333333333333331},{"$f":"IF(ISERROR((SUM(B148:M148))/B4),\"\",(SUM(B148:M148))/B4)","v":0.20416666666666669}]
[{"$f":"IF(ISERROR(Q!A5),\"\",Q!A5)","v":"Was PVP documented?"},{"$f":"IFERROR(INDEX(April!F:F,MATCH(Year!A:A,April!A:A,0)),\"\")","v":0},{"$f":"IFERROR(INDEX(May!F:F,MATCH(Year!A:A,May!A:A,0)),\"\")","v":0},{"$f":"IFERROR(INDEX(June!F:F,MATCH(Year!A:A,June!A:A,0)),\"\")","v":0},{"$f":"IFERROR(INDEX(July!F:F,MATCH(Year!A:A,July!A:A,0)),\"\")","v":0},{"$f":"IFERROR(INDEX(Aug!F:F,MATCH(Year!A:A,Aug!A:A,0)),\"\")","v":0},{"$f":"IFERROR(INDEX(Sept!F:F,MATCH(Year!A:A,Sept!A:A,0)),\"\")","v":0},{"$f":"IFERROR(INDEX(Oct!F:F,MATCH(Year!A:A,Oct!A:A,0)),\"\")","v":0},{"$f":"IFERROR(INDEX(Nov!F:F,MATCH(Year!A:A,Nov!A:A,0)),\"\")","v":0},{"$f":"IFERROR(INDEX(Dec!F:F,MATCH(Year!A:A,Dec!A:A,0)),\"\")","v":0},{"$f":"IFERROR(INDEX(Jan!F:F,MATCH(Year!A:A,Jan!A:A,0)),\"\")","v":0},{"$f":"IFERROR(INDEX(Feb!F:F,MATCH(Year!A:A,Feb!A:A,0)),\"\")","v":0},{"$f":"IFERROR(INDEX(March!F:F,MATCH(Year!A:A,March!A:A,0)),\"\")","v":0},{"$f":"IF(ISERROR((SUM(B149:M149))/B4),\"\",(SUM(B149:M149))/B4)","v":0}]
[{"$f":"IF(ISERROR(Q!A6),\"\",Q!A6)","v":"Was Otoscopy documented?"},{"$f":"IFERROR(INDEX(April!F:F,MATCH(Year!A:A,April!A:A,0)),\"\")","v":0},{"$f":"IFERROR(INDEX(May!F:F,MATCH(Year!A:A,May!A:A,0)),\"\")","v":0},{"$f":"IFERROR(INDEX(June!F:F,MATCH(Year!A:A,June!A:A,0)),\"\")","v":0},{"$f":"IFERROR(INDEX(July!F:F,MATCH(Year!A:A,July!A:A,0)),\"\")","v":0},{"$f":"IFERROR(INDEX(Aug!F:F,MATCH(Year!A:A,Aug!A:A,0)),\"\")","v":0},{"$f":"IFERROR(INDEX(Sept!F:F,MATCH(Year!A:A,Sept!A:A,0)),\"\")","v":0},{"$f":"IFERROR(INDEX(Oct!F:F,MATCH(Year!A:A,Oct!A:A,0)),\"\")","v":0},{"$f":"IFERROR(INDEX(Nov!F:F,MATCH(Year!A:A,Nov!A:A,0)),\"\")","v":0.25},{"$f":"IFERROR(INDEX(Dec!F:F,MATCH(Year!A:A,Dec!A:A,0)),\"\")","v":0},{"$f":"IFERROR(INDEX(Jan!F:F,MATCH(Year!A:A,Jan!A:A,0)),\"\")","v":0},{"$f":"IFERROR(INDEX(Feb!F:F,MATCH(Year!A:A,Feb!A:A,0)),\"\")","v":0.2},{"$f":"IFERROR(INDEX(March!F:F,MATCH(Year!A:A,March!A:A,0)),\"\")","v":0},{"$f":"IF(ISERROR((SUM(B150:M150))/B4),\"\",(SUM(B150:M150))/B4)","v":3.7499999999999999E-2}]
[{"$f":"IF(ISERROR(Q!A7),\"\",Q!A7)","v":"Document bc at 3 & 4kHz is for programming purposes?"},{"$f":"IFERROR(INDEX(April!F:F,MATCH(Year!A:A,April!A:A,0)),\"\")","v":0},{"$f":"IFERROR(INDEX(May!F:F,MATCH(Year!A:A,May!A:A,0)),\"\")","v":0},{"$f":"IFERROR(INDEX(June!F:F,MATCH(Year!A:A,June!A:A,0)),\"\")","v":0},{"$f":"IFERROR(INDEX(July!F:F,MATCH(Year!A:A,July!A:A,0)),\"\")","v":0},{"$f":"IFERROR(INDEX(Aug!F:F,MATCH(Year!A:A,Aug!A:A,0)),\"\")","v":0},{"$f":"IFERROR(INDEX(Sept!F:F,MATCH(Year!A:A,Sept!A:A,0)),\"\")","v":0},{"$f":"IFERROR(INDEX(Oct!F:F,MATCH(Year!A:A,Oct!A:A,0)),\"\")","v":0},{"$f":"IFERROR(INDEX(Nov!F:F,MATCH(Year!A:A,Nov!A:A,0)),\"\")","v":0},{"$f":"IFERROR(INDEX(Dec!F:F,MATCH(Year!A:A,Dec!A:A,0)),\"\")","v":0},{"$f":"IFERROR(INDEX(Jan!F:F,MATCH(Year!A:A,Jan!A:A,0)),\"\")","v":0},{"$f":"IFERROR(INDEX(Feb!F:F,MATCH(Year!A:A,Feb!A:A,0)),\"\")","v":0},{"$f":"IFERROR(INDEX(March!F:F,MATCH(Year!A:A,March!A:A,0)),\"\")","v":0},{"$f":"IF(ISERROR((SUM(B151:M151))/B4),\"\",(SUM(B151:M151))/B4)","v":0}]
[{"$f":"IF(ISERROR(Q!A8),\"\",Q!A8)","v":"Was Speech testing performed?"},{"$f":"IFERROR(INDEX(April!F:F,MATCH(Year!A:A,April!A:A,0)),\"\")","v":0},{"$f":"IFERROR(INDEX(May!F:F,MATCH(Year!A:A,May!A:A,0)),\"\")","v":0},{"$f":"IFERROR(INDEX(June!F:F,MATCH(Year!A:A,June!A:A,0)),\"\")","v":0},{"$f":"IFERROR(INDEX(July!F:F,MATCH(Year!A:A,July!A:A,0)),\"\")","v":0},{"$f":"IFERROR(INDEX(Aug!F:F,MATCH(Year!A:A,Aug!A:A,0)),\"\")","v":0},{"$f":"IFERROR(INDEX(Sept!F:F,MATCH(Year!A:A,Sept!A:A,0)),\"\")","v":0},{"$f":"IFERROR(INDEX(Oct!F:F,MATCH(Year!A:A,Oct!A:A,0)),\"\")","v":0},{"$f":"IFERROR(INDEX(Nov!F:F,MATCH(Year!A:A,Nov!A:A,0)),\"\")","v":0},{"$f":"IFERROR(INDEX(Dec!F:F,MATCH(Year!A:A,Dec!A:A,0)),\"\")","v":0},{"$f":"IFERROR(INDEX(Jan!F:F,MATCH(Year!A:A,Jan!A:A,0)),\"\")","v":0},{"$f":"IFERROR(INDEX(Feb!F:F,MATCH(Year!A:A,Feb!A:A,0)),\"\")","v":0},{"$f":"IFERROR(INDEX(March!F:F,MATCH(Year!A:A,March!A:A,0)),\"\")","v":0},{"$f":"IF(ISERROR((SUM(B152:M152))/B4),\"\",(SUM(B152:M152))/B4)","v":0}]
[{"$f":"IF(ISERROR(Q!A9),\"\",Q!A9)","v":"Is it documented whether national criteria were/were not met?"},{"$f":"IFERROR(INDEX(April!F:F,MATCH(Year!A:A,April!A:A,0)),\"\")","v":0.2},{"$f":"IFERROR(INDEX(May!F:F,MATCH(Year!A:A,May!A:A,0)),\"\")","v":0},{"$f":"IFERROR(INDEX(June!F:F,MATCH(Year!A:A,June!A:A,0)),\"\")","v":0},{"$f":"IFERROR(INDEX(July!F:F,MATCH(Year!A:A,July!A:A,0)),\"\")","v":0},{"$f":"IFERROR(INDEX(Aug!F:F,MATCH(Year!A:A,Aug!A:A,0)),\"\")","v":0},{"$f":"IFERROR(INDEX(Sept!F:F,MATCH(Year!A:A,Sept!A:A,0)),\"\")","v":0},{"$f":"IFERROR(INDEX(Oct!F:F,MATCH(Year!A:A,Oct!A:A,0)),\"\")","v":0},{"$f":"IFERROR(INDEX(Nov!F:F,MATCH(Year!A:A,Nov!A:A,0)),\"\")","v":0},{"$f":"IFERROR(INDEX(Dec!F:F,MATCH(Year!A:A,Dec!A:A,0)),\"\")","v":0},{"$f":"IFERROR(INDEX(Jan!F:F,MATCH(Year!A:A,Jan!A:A,0)),\"\")","v":0},{"$f":"IFERROR(INDEX(Feb!F:F,MATCH(Year!A:A,Feb!A:A,0)),\"\")","v":0},{"$f":"IFERROR(INDEX(March!F:F,MATCH(Year!A:A,March!A:A,0)),\"\")","v":0},{"$f":"IF(ISERROR((SUM(B153:M153))/B4),\"\",(SUM(B153:M153))/B4)","v":1.6666666666666666E-2}]
[{"$f":"IF(ISERROR(Q!A10),\"\",Q!A10)","v":"Was a BCHI info pack supplied?"},{"$f":"IFERROR(INDEX(April!F:F,MATCH(Year!A:A,April!A:A,0)),\"\")","v":0},{"$f":"IFERROR(INDEX(May!F:F,MATCH(Year!A:A,May!A:A,0)),\"\")","v":0},{"$f":"IFERROR(INDEX(June!F:F,MATCH(Year!A:A,June!A:A,0)),\"\")","v":0},{"$f":"IFERROR(INDEX(July!F:F,MATCH(Year!A:A,July!A:A,0)),\"\")","v":0},{"$f":"IFERROR(INDEX(Aug!F:F,MATCH(Year!A:A,Aug!A:A,0)),\"\")","v":0},{"$f":"IFERROR(INDEX(Sept!F:F,MATCH(Year!A:A,Sept!A:A,0)),\"\")","v":0},{"$f":"IFERROR(INDEX(Oct!F:F,MATCH(Year!A:A,Oct!A:A,0)),\"\")","v":0},{"$f":"IFERROR(INDEX(Nov!F:F,MATCH(Year!A:A,Nov!A:A,0)),\"\")","v":0},{"$f":"IFERROR(INDEX(Dec!F:F,MATCH(Year!A:A,Dec!A:A,0)),\"\")","v":0},{"$f":"IFERROR(INDEX(Jan!F:F,MATCH(Year!A:A,Jan!A:A,0)),\"\")","v":0},{"$f":"IFERROR(INDEX(Feb!F:F,MATCH(Year!A:A,Feb!A:A,0)),\"\")","v":0},{"$f":"IFERROR(INDEX(March!F:F,MATCH(Year!A:A,March!A:A,0)),\"\")","v":0},{"$f":"IF(ISERROR((SUM(B154:M154))/B4),\"\",(SUM(B154:M154))/B4)","v":0}]
[{"$f":"IF(ISERROR(Q!A11),\"\",Q!A11)","v":"Was the report authorised & issued within target (7 days)?"},{"$f":"IFERROR(INDEX(April!F:F,MATCH(Year!A:A,April!A:A,0)),\"\")","v":0},{"$f":"IFERROR(INDEX(May!F:F,MATCH(Year!A:A,May!A:A,0)),\"\")","v":0},{"$f":"IFERROR(INDEX(June!F:F,MATCH(Year!A:A,June!A:A,0)),\"\")","v":0},{"$f":"IFERROR(INDEX(July!F:F,MATCH(Year!A:A,July!A:A,0)),\"\")","v":0},{"$f":"IFERROR(INDEX(Aug!F:F,MATCH(Year!A:A,Aug!A:A,0)),\"\")","v":0},{"$f":"IFERROR(INDEX(Sept!F:F,MATCH(Year!A:A,Sept!A:A,0)),\"\")","v":0},{"$f":"IFERROR(INDEX(Oct!F:F,MATCH(Year!A:A,Oct!A:A,0)),\"\")","v":0},{"$f":"IFERROR(INDEX(Nov!F:F,MATCH(Year!A:A,Nov!A:A,0)),\"\")","v":0},{"$f":"IFERROR(INDEX(Dec!F:F,MATCH(Year!A:A,Dec!A:A,0)),\"\")","v":0},{"$f":"IFERROR(INDEX(Jan!F:F,MATCH(Year!A:A,Jan!A:A,0)),\"\")","v":0},{"$f":"IFERROR(INDEX(Feb!F:F,MATCH(Year!A:A,Feb!A:A,0)),\"\")","v":0},{"$f":"IFERROR(INDEX(March!F:F,MATCH(Year!A:A,March!A:A,0)),\"\")","v":0},{"$f":"IF(ISERROR((SUM(B155:M155))/B4),\"\",(SUM(B155:M155))/B4)","v":0}]
[{"$f":"IF(ISERROR(Q!A12),\"\",Q!A12)","v":"Was consent documented as appropriate?"},{"$f":"IFERROR(INDEX(April!F:F,MATCH(Year!A:A,April!A:A,0)),\"\")","v":0},{"$f":"IFERROR(INDEX(May!F:F,MATCH(Year!A:A,May!A:A,0)),\"\")","v":0},{"$f":"IFERROR(INDEX(June!F:F,MATCH(Year!A:A,June!A:A,0)),\"\")","v":0},{"$f":"IFERROR(INDEX(July!F:F,MATCH(Year!A:A,July!A:A,0)),\"\")","v":0},{"$f":"IFERROR(INDEX(Aug!F:F,MATCH(Year!A:A,Aug!A:A,0)),\"\")","v":0},{"$f":"IFERROR(INDEX(Sept!F:F,MATCH(Year!A:A,Sept!A:A,0)),\"\")","v":0},{"$f":"IFERROR(INDEX(Oct!F:F,MATCH(Year!A:A,Oct!A:A,0)),\"\")","v":0},{"$f":"IFERROR(INDEX(Nov!F:F,MATCH(Year!A:A,Nov!A:A,0)),\"\")","v":0},{"$f":"IFERROR(INDEX(Dec!F:F,MATCH(Year!A:A,Dec!A:A,0)),\"\")","v":0},{"$f":"IFERROR(INDEX(Jan!F:F,MATCH(Year!A:A,Jan!A:A,0)),\"\")","v":0},{"$f":"IFERROR(INDEX(Feb!F:F,MATCH(Year!A:A,Feb!A:A,0)),\"\")","v":0},{"$f":"IFERROR(INDEX(March!F:F,MATCH(Year!A:A,March!A:A,0)),\"\")","v":0},{"$f":"IF(ISERROR((SUM(B156:M156))/B4),\"\",(SUM(B156:M156))/B4)","v":0}]
[{"$f":"IF(ISERROR(Q!A13),\"\",Q!A13)","v":0},{"$f":"IFERROR(INDEX(April!F:F,MATCH(Year!A:A,April!A:A,0)),\"\")","v":""},{"$f":"IFERROR(INDEX(May!F:F,MATCH(Year!A:A,May!A:A,0)),\"\")","v":""},{"$f":"IFERROR(INDEX(June!F:F,MATCH(Year!A:A,June!A:A,0)),\"\")","v":""},{"$f":"IFERROR(INDEX(July!F:F,MATCH(Year!A:A,July!A:A,0)),\"\")","v":""},{"$f":"IFERROR(INDEX(Aug!F:F,MATCH(Year!A:A,Aug!A:A,0)),\"\")","v":""},{"$f":"IFERROR(INDEX(Sept!F:F,MATCH(Year!A:A,Sept!A:A,0)),\"\")","v":""},{"$f":"IFERROR(INDEX(Oct!F:F,MATCH(Year!A:A,Oct!A:A,0)),\"\")","v":""},{"$f":"IFERROR(INDEX(Nov!F:F,MATCH(Year!A:A,Nov!A:A,0)),\"\")","v":""},{"$f":"IFERROR(INDEX(Dec!F:F,MATCH(Year!A:A,Dec!A:A,0)),\"\")","v":""},{"$f":"IFERROR(INDEX(Jan!F:F,MATCH(Year!A:A,Jan!A:A,0)),\"\")","v":""},{"$f":"IFERROR(INDEX(Feb!F:F,MATCH(Year!A:A,Feb!A:A,0)),\"\")","v":""},{"$f":"IFERROR(INDEX(March!F:F,MATCH(Year!A:A,March!A:A,0)),\"\")","v":""},{"$f":"IF(ISERROR((SUM(B157:M157))/B4),\"\",(SUM(B157:M157))/B4)","v":0}]
[{"$f":"IF(ISERROR(Q!A14),\"\",Q!A14)","v":0},{"$f":"IFERROR(INDEX(April!F:F,MATCH(Year!A:A,April!A:A,0)),\"\")","v":""},{"$f":"IFERROR(INDEX(May!F:F,MATCH(Year!A:A,May!A:A,0)),\"\")","v":""},{"$f":"IFERROR(INDEX(June!F:F,MATCH(Year!A:A,June!A:A,0)),\"\")","v":""},{"$f":"IFERROR(INDEX(July!F:F,MATCH(Year!A:A,July!A:A,0)),\"\")","v":""},{"$f":"IFERROR(INDEX(Aug!F:F,MATCH(Year!A:A,Aug!A:A,0)),\"\")","v":""},{"$f":"IFERROR(INDEX(Sept!F:F,MATCH(Year!A:A,Sept!A:A,0)),\"\")","v":""},{"$f":"IFERROR(INDEX(Oct!F:F,MATCH(Year!A:A,Oct!A:A,0)),\"\")","v":""},{"$f":"IFERROR(INDEX(Nov!F:F,MATCH(Year!A:A,Nov!A:A,0)),\"\")","v":""},{"$f":"IFERROR(INDEX(Dec!F:F,MATCH(Year!A:A,Dec!A:A,0)),\"\")","v":""},{"$f":"IFERROR(INDEX(Jan!F:F,MATCH(Year!A:A,Jan!A:A,0)),\"\")","v":""},{"$f":"IFERROR(INDEX(Feb!F:F,MATCH(Year!A:A,Feb!A:A,0)),\"\")","v":""},{"$f":"IFERROR(INDEX(March!F:F,MATCH(Year!A:A,March!A:A,0)),\"\")","v":""},{"$f":"IF(ISERROR((SUM(B158:M158))/B4),\"\",(SUM(B158:M158))/B4)","v":0}]
[{"$f":"IF(ISERROR(Q!A15),\"\",Q!A15)","v":0},{"$f":"IFERROR(INDEX(April!F:F,MATCH(Year!A:A,April!A:A,0)),\"\")","v":""},{"$f":"IFERROR(INDEX(May!F:F,MATCH(Year!A:A,May!A:A,0)),\"\")","v":""},{"$f":"IFERROR(INDEX(June!F:F,MATCH(Year!A:A,June!A:A,0)),\"\")","v":""},{"$f":"IFERROR(INDEX(July!F:F,MATCH(Year!A:A,July!A:A,0)),\"\")","v":""},{"$f":"IFERROR(INDEX(Aug!F:F,MATCH(Year!A:A,Aug!A:A,0)),\"\")","v":""},{"$f":"IFERROR(INDEX(Sept!F:F,MATCH(Year!A:A,Sept!A:A,0)),\"\")","v":""},{"$f":"IFERROR(INDEX(Oct!F:F,MATCH(Year!A:A,Oct!A:A,0)),\"\")","v":""},{"$f":"IFERROR(INDEX(Nov!F:F,MATCH(Year!A:A,Nov!A:A,0)),\"\")","v":""},{"$f":"IFERROR(INDEX(Dec!F:F,MATCH(Year!A:A,Dec!A:A,0)),\"\")","v":""},{"$f":"IFERROR(INDEX(Jan!F:F,MATCH(Year!A:A,Jan!A:A,0)),\"\")","v":""},{"$f":"IFERROR(INDEX(Feb!F:F,MATCH(Year!A:A,Feb!A:A,0)),\"\")","v":""},{"$f":"IFERROR(INDEX(March!F:F,MATCH(Year!A:A,March!A:A,0)),\"\")","v":""},{"$f":"IF(ISERROR((SUM(B159:M159))/B4),\"\",(SUM(B159:M159))/B4)","v":0}]
[{"$f":"IF(ISERROR(Q!A16),\"\",Q!A16)","v":0},{"$f":"IFERROR(INDEX(April!F:F,MATCH(Year!A:A,April!A:A,0)),\"\")","v":""},{"$f":"IFERROR(INDEX(May!F:F,MATCH(Year!A:A,May!A:A,0)),\"\")","v":""},{"$f":"IFERROR(INDEX(June!F:F,MATCH(Year!A:A,June!A:A,0)),\"\")","v":""},{"$f":"IFERROR(INDEX(July!F:F,MATCH(Year!A:A,July!A:A,0)),\"\")","v":""},{"$f":"IFERROR(INDEX(Aug!F:F,MATCH(Year!A:A,Aug!A:A,0)),\"\")","v":""},{"$f":"IFERROR(INDEX(Sept!F:F,MATCH(Year!A:A,Sept!A:A,0)),\"\")","v":""},{"$f":"IFERROR(INDEX(Oct!F:F,MATCH(Year!A:A,Oct!A:A,0)),\"\")","v":""},{"$f":"IFERROR(INDEX(Nov!F:F,MATCH(Year!A:A,Nov!A:A,0)),\"\")","v":""},{"$f":"IFERROR(INDEX(Dec!F:F,MATCH(Year!A:A,Dec!A:A,0)),\"\")","v":""},{"$f":"IFERROR(INDEX(Jan!F:F,MATCH(Year!A:A,Jan!A:A,0)),\"\")","v":""},{"$f":"IFERROR(INDEX(Feb!F:F,MATCH(Year!A:A,Feb!A:A,0)),\"\")","v":""},{"$f":"IFERROR(INDEX(March!F:F,MATCH(Year!A:A,March!A:A,0)),\"\")","v":""},{"$f":"IF(ISERROR((SUM(B160:M160))/B4),\"\",(SUM(B160:M160))/B4)","v":0}]
[{"$f":"IF(ISERROR(Q!A17),\"\",Q!A17)","v":0},{"$f":"IFERROR(INDEX(April!F:F,MATCH(Year!A:A,April!A:A,0)),\"\")","v":""},{"$f":"IFERROR(INDEX(May!F:F,MATCH(Year!A:A,May!A:A,0)),\"\")","v":""},{"$f":"IFERROR(INDEX(June!F:F,MATCH(Year!A:A,June!A:A,0)),\"\")","v":""},{"$f":"IFERROR(INDEX(July!F:F,MATCH(Year!A:A,July!A:A,0)),\"\")","v":""},{"$f":"IFERROR(INDEX(Aug!F:F,MATCH(Year!A:A,Aug!A:A,0)),\"\")","v":""},{"$f":"IFERROR(INDEX(Sept!F:F,MATCH(Year!A:A,Sept!A:A,0)),\"\")","v":""},{"$f":"IFERROR(INDEX(Oct!F:F,MATCH(Year!A:A,Oct!A:A,0)),\"\")","v":""},{"$f":"IFERROR(INDEX(Nov!F:F,MATCH(Year!A:A,Nov!A:A,0)),\"\")","v":""},{"$f":"IFERROR(INDEX(Dec!F:F,MATCH(Year!A:A,Dec!A:A,0)),\"\")","v":""},{"$f":"IFERROR(INDEX(Jan!F:F,MATCH(Year!A:A,Jan!A:A,0)),\"\")","v":""},{"$f":"IFERROR(INDEX(Feb!F:F,MATCH(Year!A:A,Feb!A:A,0)),\"\")","v":""},{"$f":"IFERROR(INDEX(March!F:F,MATCH(Year!A:A,March!A:A,0)),\"\")","v":""},{"$f":"IF(ISERROR((SUM(B161:M161))/B4),\"\",(SUM(B161:M161))/B4)","v":0}]
[{"$f":"IF(ISERROR(Q!A18),\"\",Q!A18)","v":0},{"$f":"IFERROR(INDEX(April!F:F,MATCH(Year!A:A,April!A:A,0)),\"\")","v":""},{"$f":"IFERROR(INDEX(May!F:F,MATCH(Year!A:A,May!A:A,0)),\"\")","v":""},{"$f":"IFERROR(INDEX(June!F:F,MATCH(Year!A:A,June!A:A,0)),\"\")","v":""},{"$f":"IFERROR(INDEX(July!F:F,MATCH(Year!A:A,July!A:A,0)),\"\")","v":""},{"$f":"IFERROR(INDEX(Aug!F:F,MATCH(Year!A:A,Aug!A:A,0)),\"\")","v":""},{"$f":"IFERROR(INDEX(Sept!F:F,MATCH(Year!A:A,Sept!A:A,0)),\"\")","v":""},{"$f":"IFERROR(INDEX(Oct!F:F,MATCH(Year!A:A,Oct!A:A,0)),\"\")","v":""},{"$f":"IFERROR(INDEX(Nov!F:F,MATCH(Year!A:A,Nov!A:A,0)),\"\")","v":""},{"$f":"IFERROR(INDEX(Dec!F:F,MATCH(Year!A:A,Dec!A:A,0)),\"\")","v":""},{"$f":"IFERROR(INDEX(Jan!F:F,MATCH(Year!A:A,Jan!A:A,0)),\"\")","v":""},{"$f":"IFERROR(INDEX(Feb!F:F,MATCH(Year!A:A,Feb!A:A,0)),\"\")","v":""},{"$f":"IFERROR(INDEX(March!F:F,MATCH(Year!A:A,March!A:A,0)),\"\")","v":""},{"$f":"IF(ISERROR((SUM(B162:M162))/B4),\"\",(SUM(B162:M162))/B4)","v":0}]
[{"$f":"IF(ISERROR(Q!A19),\"\",Q!A19)","v":0},{"$f":"IFERROR(INDEX(April!F:F,MATCH(Year!A:A,April!A:A,0)),\"\")","v":""},{"$f":"IFERROR(INDEX(May!F:F,MATCH(Year!A:A,May!A:A,0)),\"\")","v":""},{"$f":"IFERROR(INDEX(June!F:F,MATCH(Year!A:A,June!A:A,0)),\"\")","v":""},{"$f":"IFERROR(INDEX(July!F:F,MATCH(Year!A:A,July!A:A,0)),\"\")","v":""},{"$f":"IFERROR(INDEX(Aug!F:F,MATCH(Year!A:A,Aug!A:A,0)),\"\")","v":""},{"$f":"IFERROR(INDEX(Sept!F:F,MATCH(Year!A:A,Sept!A:A,0)),\"\")","v":""},{"$f":"IFERROR(INDEX(Oct!F:F,MATCH(Year!A:A,Oct!A:A,0)),\"\")","v":""},{"$f":"IFERROR(INDEX(Nov!F:F,MATCH(Year!A:A,Nov!A:A,0)),\"\")","v":""},{"$f":"IFERROR(INDEX(Dec!F:F,MATCH(Year!A:A,Dec!A:A,0)),\"\")","v":""},{"$f":"IFERROR(INDEX(Jan!F:F,MATCH(Year!A:A,Jan!A:A,0)),\"\")","v":""},{"$f":"IFERROR(INDEX(Feb!F:F,MATCH(Year!A:A,Feb!A:A,0)),\"\")","v":""},{"$f":"IFERROR(INDEX(March!F:F,MATCH(Year!A:A,March!A:A,0)),\"\")","v":""},{"$f":"IF(ISERROR((SUM(B163:M163))/B4),\"\",(SUM(B163:M163))/B4)","v":0}]
[{"$f":"IF(ISERROR(Q!A20),\"\",Q!A20)","v":0},{"$f":"IFERROR(INDEX(April!F:F,MATCH(Year!A:A,April!A:A,0)),\"\")","v":""},{"$f":"IFERROR(INDEX(May!F:F,MATCH(Year!A:A,May!A:A,0)),\"\")","v":""},{"$f":"IFERROR(INDEX(June!F:F,MATCH(Year!A:A,June!A:A,0)),\"\")","v":""},{"$f":"IFERROR(INDEX(July!F:F,MATCH(Year!A:A,July!A:A,0)),\"\")","v":""},{"$f":"IFERROR(INDEX(Aug!F:F,MATCH(Year!A:A,Aug!A:A,0)),\"\")","v":""},{"$f":"IFERROR(INDEX(Sept!F:F,MATCH(Year!A:A,Sept!A:A,0)),\"\")","v":""},{"$f":"IFERROR(INDEX(Oct!F:F,MATCH(Year!A:A,Oct!A:A,0)),\"\")","v":""},{"$f":"IFERROR(INDEX(Nov!F:F,MATCH(Year!A:A,Nov!A:A,0)),\"\")","v":""},{"$f":"IFERROR(INDEX(Dec!F:F,MATCH(Year!A:A,Dec!A:A,0)),\"\")","v":""},{"$f":"IFERROR(INDEX(Jan!F:F,MATCH(Year!A:A,Jan!A:A,0)),\"\")","v":""},{"$f":"IFERROR(INDEX(Feb!F:F,MATCH(Year!A:A,Feb!A:A,0)),\"\")","v":""},{"$f":"IFERROR(INDEX(March!F:F,MATCH(Year!A:A,March!A:A,0)),\"\")","v":""},{"$f":"IF(ISERROR((SUM(B164:M164))/B4),\"\",(SUM(B164:M164))/B4)","v":0}]
[{"$f":"IF(ISERROR(Q!A21),\"\",Q!A21)","v":0},{"$f":"IFERROR(INDEX(April!F:F,MATCH(Year!A:A,April!A:A,0)),\"\")","v":""},{"$f":"IFERROR(INDEX(May!F:F,MATCH(Year!A:A,May!A:A,0)),\"\")","v":""},{"$f":"IFERROR(INDEX(June!F:F,MATCH(Year!A:A,June!A:A,0)),\"\")","v":""},{"$f":"IFERROR(INDEX(July!F:F,MATCH(Year!A:A,July!A:A,0)),\"\")","v":""},{"$f":"IFERROR(INDEX(Aug!F:F,MATCH(Year!A:A,Aug!A:A,0)),\"\")","v":""},{"$f":"IFERROR(INDEX(Sept!F:F,MATCH(Year!A:A,Sept!A:A,0)),\"\")","v":""},{"$f":"IFERROR(INDEX(Oct!F:F,MATCH(Year!A:A,Oct!A:A,0)),\"\")","v":""},{"$f":"IFERROR(INDEX(Nov!F:F,MATCH(Year!A:A,Nov!A:A,0)),\"\")","v":""},{"$f":"IFERROR(INDEX(Dec!F:F,MATCH(Year!A:A,Dec!A:A,0)),\"\")","v":""},{"$f":"IFERROR(INDEX(Jan!F:F,MATCH(Year!A:A,Jan!A:A,0)),\"\")","v":""},{"$f":"IFERROR(INDEX(Feb!F:F,MATCH(Year!A:A,Feb!A:A,0)),\"\")","v":""},{"$f":"IFERROR(INDEX(March!F:F,MATCH(Year!A:A,March!A:A,0)),\"\")","v":""},{"$f":"IF(ISERROR((SUM(B165:M165))/B4),\"\",(SUM(B165:M165))/B4)","v":0}]
[{"$f":"IF(ISERROR(Q!A22),\"\",Q!A22)","v":0},{"$f":"IFERROR(INDEX(April!F:F,MATCH(Year!A:A,April!A:A,0)),\"\")","v":""},{"$f":"IFERROR(INDEX(May!F:F,MATCH(Year!A:A,May!A:A,0)),\"\")","v":""},{"$f":"IFERROR(INDEX(June!F:F,MATCH(Year!A:A,June!A:A,0)),\"\")","v":""},{"$f":"IFERROR(INDEX(July!F:F,MATCH(Year!A:A,July!A:A,0)),\"\")","v":""},{"$f":"IFERROR(INDEX(Aug!F:F,MATCH(Year!A:A,Aug!A:A,0)),\"\")","v":""},{"$f":"IFERROR(INDEX(Sept!F:F,MATCH(Year!A:A,Sept!A:A,0)),\"\")","v":""},{"$f":"IFERROR(INDEX(Oct!F:F,MATCH(Year!A:A,Oct!A:A,0)),\"\")","v":""},{"$f":"IFERROR(INDEX(Nov!F:F,MATCH(Year!A:A,Nov!A:A,0)),\"\")","v":""},{"$f":"IFERROR(INDEX(Dec!F:F,MATCH(Year!A:A,Dec!A:A,0)),\"\")","v":""},{"$f":"IFERROR(INDEX(Jan!F:F,MATCH(Year!A:A,Jan!A:A,0)),\"\")","v":""},{"$f":"IFERROR(INDEX(Feb!F:F,MATCH(Year!A:A,Feb!A:A,0)),\"\")","v":""},{"$f":"IFERROR(INDEX(March!F:F,MATCH(Year!A:A,March!A:A,0)),\"\")","v":""},{"$f":"IF(ISERROR((SUM(B166:M166))/B4),\"\",(SUM(B166:M166))/B4)","v":0}]
[{"$f":"IF(ISERROR(Q!A23),\"\",Q!A23)","v":0},{"$f":"IFERROR(INDEX(April!F:F,MATCH(Year!A:A,April!A:A,0)),\"\")","v":""},{"$f":"IFERROR(INDEX(May!F:F,MATCH(Year!A:A,May!A:A,0)),\"\")","v":""},{"$f":"IFERROR(INDEX(June!F:F,MATCH(Year!A:A,June!A:A,0)),\"\")","v":""},{"$f":"IFERROR(INDEX(July!F:F,MATCH(Year!A:A,July!A:A,0)),\"\")","v":""},{"$f":"IFERROR(INDEX(Aug!F:F,MATCH(Year!A:A,Aug!A:A,0)),\"\")","v":""},{"$f":"IFERROR(INDEX(Sept!F:F,MATCH(Year!A:A,Sept!A:A,0)),\"\")","v":""},{"$f":"IFERROR(INDEX(Oct!F:F,MATCH(Year!A:A,Oct!A:A,0)),\"\")","v":""},{"$f":"IFERROR(INDEX(Nov!F:F,MATCH(Year!A:A,Nov!A:A,0)),\"\")","v":""},{"$f":"IFERROR(INDEX(Dec!F:F,MATCH(Year!A:A,Dec!A:A,0)),\"\")","v":""},{"$f":"IFERROR(INDEX(Jan!F:F,MATCH(Year!A:A,Jan!A:A,0)),\"\")","v":""},{"$f":"IFERROR(INDEX(Feb!F:F,MATCH(Year!A:A,Feb!A:A,0)),\"\")","v":""},{"$f":"IFERROR(INDEX(March!F:F,MATCH(Year!A:A,March!A:A,0)),\"\")","v":""},{"$f":"IF(ISERROR((SUM(B167:M167))/B4),\"\",(SUM(B167:M167))/B4)","v":0}]
[{"$f":"IF(ISERROR(Q!A24),\"\",Q!A24)","v":0},{"$f":"IFERROR(INDEX(April!F:F,MATCH(Year!A:A,April!A:A,0)),\"\")","v":""},{"$f":"IFERROR(INDEX(May!F:F,MATCH(Year!A:A,May!A:A,0)),\"\")","v":""},{"$f":"IFERROR(INDEX(June!F:F,MATCH(Year!A:A,June!A:A,0)),\"\")","v":""},{"$f":"IFERROR(INDEX(July!F:F,MATCH(Year!A:A,July!A:A,0)),\"\")","v":""},{"$f":"IFERROR(INDEX(Aug!F:F,MATCH(Year!A:A,Aug!A:A,0)),\"\")","v":""},{"$f":"IFERROR(INDEX(Sept!F:F,MATCH(Year!A:A,Sept!A:A,0)),\"\")","v":""},{"$f":"IFERROR(INDEX(Oct!F:F,MATCH(Year!A:A,Oct!A:A,0)),\"\")","v":""},{"$f":"IFERROR(INDEX(Nov!F:F,MATCH(Year!A:A,Nov!A:A,0)),\"\")","v":""},{"$f":"IFERROR(INDEX(Dec!F:F,MATCH(Year!A:A,Dec!A:A,0)),\"\")","v":""},{"$f":"IFERROR(INDEX(Jan!F:F,MATCH(Year!A:A,Jan!A:A,0)),\"\")","v":""},{"$f":"IFERROR(INDEX(Feb!F:F,MATCH(Year!A:A,Feb!A:A,0)),\"\")","v":""},{"$f":"IFERROR(INDEX(March!F:F,MATCH(Year!A:A,March!A:A,0)),\"\")","v":""},{"$f":"IF(ISERROR((SUM(B168:M168))/B4),\"\",(SUM(B168:M168))/B4)","v":0}]
[{"$f":"IF(ISERROR(Q!A25),\"\",Q!A25)","v":0},{"$f":"IFERROR(INDEX(April!F:F,MATCH(Year!A:A,April!A:A,0)),\"\")","v":""},{"$f":"IFERROR(INDEX(May!F:F,MATCH(Year!A:A,May!A:A,0)),\"\")","v":""},{"$f":"IFERROR(INDEX(June!F:F,MATCH(Year!A:A,June!A:A,0)),\"\")","v":""},{"$f":"IFERROR(INDEX(July!F:F,MATCH(Year!A:A,July!A:A,0)),\"\")","v":""},{"$f":"IFERROR(INDEX(Aug!F:F,MATCH(Year!A:A,Aug!A:A,0)),\"\")","v":""},{"$f":"IFERROR(INDEX(Sept!F:F,MATCH(Year!A:A,Sept!A:A,0)),\"\")","v":""},{"$f":"IFERROR(INDEX(Oct!F:F,MATCH(Year!A:A,Oct!A:A,0)),\"\")","v":""},{"$f":"IFERROR(INDEX(Nov!F:F,MATCH(Year!A:A,Nov!A:A,0)),\"\")","v":""},{"$f":"IFERROR(INDEX(Dec!F:F,MATCH(Year!A:A,Dec!A:A,0)),\"\")","v":""},{"$f":"IFERROR(INDEX(Jan!F:F,MATCH(Year!A:A,Jan!A:A,0)),\"\")","v":""},{"$f":"IFERROR(INDEX(Feb!F:F,MATCH(Year!A:A,Feb!A:A,0)),\"\")","v":""},{"$f":"IFERROR(INDEX(March!F:F,MATCH(Year!A:A,March!A:A,0)),\"\")","v":""},{"$f":"IF(ISERROR((SUM(B169:M169))/B4),\"\",(SUM(B169:M169))/B4)","v":0}]
[{"$f":"IF(ISERROR(Q!A26),\"\",Q!A26)","v":0},{"$f":"IFERROR(INDEX(April!F:F,MATCH(Year!A:A,April!A:A,0)),\"\")","v":""},{"$f":"IFERROR(INDEX(May!F:F,MATCH(Year!A:A,May!A:A,0)),\"\")","v":""},{"$f":"IFERROR(INDEX(June!F:F,MATCH(Year!A:A,June!A:A,0)),\"\")","v":""},{"$f":"IFERROR(INDEX(July!F:F,MATCH(Year!A:A,July!A:A,0)),\"\")","v":""},{"$f":"IFERROR(INDEX(Aug!F:F,MATCH(Year!A:A,Aug!A:A,0)),\"\")","v":""},{"$f":"IFERROR(INDEX(Sept!F:F,MATCH(Year!A:A,Sept!A:A,0)),\"\")","v":""},{"$f":"IFERROR(INDEX(Oct!F:F,MATCH(Year!A:A,Oct!A:A,0)),\"\")","v":""},{"$f":"IFERROR(INDEX(Nov!F:F,MATCH(Year!A:A,Nov!A:A,0)),\"\")","v":""},{"$f":"IFERROR(INDEX(Dec!F:F,MATCH(Year!A:A,Dec!A:A,0)),\"\")","v":""},{"$f":"IFERROR(INDEX(Jan!F:F,MATCH(Year!A:A,Jan!A:A,0)),\"\")","v":""},{"$f":"IFERROR(INDEX(Feb!F:F,MATCH(Year!A:A,Feb!A:A,0)),\"\")","v":""},{"$f":"IFERROR(INDEX(March!F:F,MATCH(Year!A:A,March!A:A,0)),\"\")","v":""},{"$f":"IF(ISERROR((SUM(B170:M170))/B4),\"\",(SUM(B170:M170))/B4)","v":0}]
[{"$f":"IF(ISERROR(Q!A27),\"\",Q!A27)","v":0},{"$f":"IFERROR(INDEX(April!F:F,MATCH(Year!A:A,April!A:A,0)),\"\")","v":""},{"$f":"IFERROR(INDEX(May!F:F,MATCH(Year!A:A,May!A:A,0)),\"\")","v":""},{"$f":"IFERROR(INDEX(June!F:F,MATCH(Year!A:A,June!A:A,0)),\"\")","v":""},{"$f":"IFERROR(INDEX(July!F:F,MATCH(Year!A:A,July!A:A,0)),\"\")","v":""},{"$f":"IFERROR(INDEX(Aug!F:F,MATCH(Year!A:A,Aug!A:A,0)),\"\")","v":""},{"$f":"IFERROR(INDEX(Sept!F:F,MATCH(Year!A:A,Sept!A:A,0)),\"\")","v":""},{"$f":"IFERROR(INDEX(Oct!F:F,MATCH(Year!A:A,Oct!A:A,0)),\"\")","v":""},{"$f":"IFERROR(INDEX(Nov!F:F,MATCH(Year!A:A,Nov!A:A,0)),\"\")","v":""},{"$f":"IFERROR(INDEX(Dec!F:F,MATCH(Year!A:A,Dec!A:A,0)),\"\")","v":""},{"$f":"IFERROR(INDEX(Jan!F:F,MATCH(Year!A:A,Jan!A:A,0)),\"\")","v":""},{"$f":"IFERROR(INDEX(Feb!F:F,MATCH(Year!A:A,Feb!A:A,0)),\"\")","v":""},{"$f":"IFERROR(INDEX(March!F:F,MATCH(Year!A:A,March!A:A,0)),\"\")","v":""},{"$f":"IF(ISERROR((SUM(B171:M171))/B4),\"\",(SUM(B171:M171))/B4)","v":0}]
[{"$f":"IF(ISERROR(Q!A28),\"\",Q!A28)","v":0},{"$f":"IFERROR(INDEX(April!F:F,MATCH(Year!A:A,April!A:A,0)),\"\")","v":""},{"$f":"IFERROR(INDEX(May!F:F,MATCH(Year!A:A,May!A:A,0)),\"\")","v":""},{"$f":"IFERROR(INDEX(June!F:F,MATCH(Year!A:A,June!A:A,0)),\"\")","v":""},{"$f":"IFERROR(INDEX(July!F:F,MATCH(Year!A:A,July!A:A,0)),\"\")","v":""},{"$f":"IFERROR(INDEX(Aug!F:F,MATCH(Year!A:A,Aug!A:A,0)),\"\")","v":""},{"$f":"IFERROR(INDEX(Sept!F:F,MATCH(Year!A:A,Sept!A:A,0)),\"\")","v":""},{"$f":"IFERROR(INDEX(Oct!F:F,MATCH(Year!A:A,Oct!A:A,0)),\"\")","v":""},{"$f":"IFERROR(INDEX(Nov!F:F,MATCH(Year!A:A,Nov!A:A,0)),\"\")","v":""},{"$f":"IFERROR(INDEX(Dec!F:F,MATCH(Year!A:A,Dec!A:A,0)),\"\")","v":""},{"$f":"IFERROR(INDEX(Jan!F:F,MATCH(Year!A:A,Jan!A:A,0)),\"\")","v":""},{"$f":"IFERROR(INDEX(Feb!F:F,MATCH(Year!A:A,Feb!A:A,0)),\"\")","v":""},{"$f":"IFERROR(INDEX(March!F:F,MATCH(Year!A:A,March!A:A,0)),\"\")","v":""},{"$f":"IF(ISERROR((SUM(B172:M172))/B4),\"\",(SUM(B172:M172))/B4)","v":0}]
[{"$f":"IF(ISERROR(Q!A29),\"\",Q!A29)","v":0},{"$f":"IFERROR(INDEX(April!F:F,MATCH(Year!A:A,April!A:A,0)),\"\")","v":""},{"$f":"IFERROR(INDEX(May!F:F,MATCH(Year!A:A,May!A:A,0)),\"\")","v":""},{"$f":"IFERROR(INDEX(June!F:F,MATCH(Year!A:A,June!A:A,0)),\"\")","v":""},{"$f":"IFERROR(INDEX(July!F:F,MATCH(Year!A:A,July!A:A,0)),\"\")","v":""},{"$f":"IFERROR(INDEX(Aug!F:F,MATCH(Year!A:A,Aug!A:A,0)),\"\")","v":""},{"$f":"IFERROR(INDEX(Sept!F:F,MATCH(Year!A:A,Sept!A:A,0)),\"\")","v":""},{"$f":"IFERROR(INDEX(Oct!F:F,MATCH(Year!A:A,Oct!A:A,0)),\"\")","v":""},{"$f":"IFERROR(INDEX(Nov!F:F,MATCH(Year!A:A,Nov!A:A,0)),\"\")","v":""},{"$f":"IFERROR(INDEX(Dec!F:F,MATCH(Year!A:A,Dec!A:A,0)),\"\")","v":""},{"$f":"IFERROR(INDEX(Jan!F:F,MATCH(Year!A:A,Jan!A:A,0)),\"\")","v":""},{"$f":"IFERROR(INDEX(Feb!F:F,MATCH(Year!A:A,Feb!A:A,0)),\"\")","v":""},{"$f":"IFERROR(INDEX(March!F:F,MATCH(Year!A:A,March!A:A,0)),\"\")","v":""},{"$f":"IF(ISERROR((SUM(B173:M173))/B4),\"\",(SUM(B173:M173))/B4)","v":0}]
[{"$f":"IF(ISERROR(Q!A30),\"\",Q!A30)","v":0},{"$f":"IFERROR(INDEX(April!F:F,MATCH(Year!A:A,April!A:A,0)),\"\")","v":""},{"$f":"IFERROR(INDEX(May!F:F,MATCH(Year!A:A,May!A:A,0)),\"\")","v":""},{"$f":"IFERROR(INDEX(June!F:F,MATCH(Year!A:A,June!A:A,0)),\"\")","v":""},{"$f":"IFERROR(INDEX(July!F:F,MATCH(Year!A:A,July!A:A,0)),\"\")","v":""},{"$f":"IFERROR(INDEX(Aug!F:F,MATCH(Year!A:A,Aug!A:A,0)),\"\")","v":""},{"$f":"IFERROR(INDEX(Sept!F:F,MATCH(Year!A:A,Sept!A:A,0)),\"\")","v":""},{"$f":"IFERROR(INDEX(Oct!F:F,MATCH(Year!A:A,Oct!A:A,0)),\"\")","v":""},{"$f":"IFERROR(INDEX(Nov!F:F,MATCH(Year!A:A,Nov!A:A,0)),\"\")","v":""},{"$f":"IFERROR(INDEX(Dec!F:F,MATCH(Year!A:A,Dec!A:A,0)),\"\")","v":""},{"$f":"IFERROR(INDEX(Jan!F:F,MATCH(Year!A:A,Jan!A:A,0)),\"\")","v":""},{"$f":"IFERROR(INDEX(Feb!F:F,MATCH(Year!A:A,Feb!A:A,0)),\"\")","v":""},{"$f":"IFERROR(INDEX(March!F:F,MATCH(Year!A:A,March!A:A,0)),\"\")","v":""},{"$f":"IF(ISERROR((SUM(B174:M174))/B4),\"\",(SUM(B174:M174))/B4)","v":0}]
[{"$f":"IF(ISERROR(Q!A31),\"\",Q!A31)","v":0},{"$f":"IFERROR(INDEX(April!F:F,MATCH(Year!A:A,April!A:A,0)),\"\")","v":""},{"$f":"IFERROR(INDEX(May!F:F,MATCH(Year!A:A,May!A:A,0)),\"\")","v":""},{"$f":"IFERROR(INDEX(June!F:F,MATCH(Year!A:A,June!A:A,0)),\"\")","v":""},{"$f":"IFERROR(INDEX(July!F:F,MATCH(Year!A:A,July!A:A,0)),\"\")","v":""},{"$f":"IFERROR(INDEX(Aug!F:F,MATCH(Year!A:A,Aug!A:A,0)),\"\")","v":""},{"$f":"IFERROR(INDEX(Sept!F:F,MATCH(Year!A:A,Sept!A:A,0)),\"\")","v":""},{"$f":"IFERROR(INDEX(Oct!F:F,MATCH(Year!A:A,Oct!A:A,0)),\"\")","v":""},{"$f":"IFERROR(INDEX(Nov!F:F,MATCH(Year!A:A,Nov!A:A,0)),\"\")","v":""},{"$f":"IFERROR(INDEX(Dec!F:F,MATCH(Year!A:A,Dec!A:A,0)),\"\")","v":""},{"$f":"IFERROR(INDEX(Jan!F:F,MATCH(Year!A:A,Jan!A:A,0)),\"\")","v":""},{"$f":"IFERROR(INDEX(Feb!F:F,MATCH(Year!A:A,Feb!A:A,0)),\"\")","v":""},{"$f":"IFERROR(INDEX(March!F:F,MATCH(Year!A:A,March!A:A,0)),\"\")","v":""},{"$f":"IF(ISERROR((SUM(B175:M175))/B4),\"\",(SUM(B175:M175))/B4)","v":0}]
[{"$f":"IF(ISERROR(Q!A32),\"\",Q!A32)","v":0},{"$f":"IFERROR(INDEX(April!F:F,MATCH(Year!A:A,April!A:A,0)),\"\")","v":""},{"$f":"IFERROR(INDEX(May!F:F,MATCH(Year!A:A,May!A:A,0)),\"\")","v":""},{"$f":"IFERROR(INDEX(June!F:F,MATCH(Year!A:A,June!A:A,0)),\"\")","v":""},{"$f":"IFERROR(INDEX(July!F:F,MATCH(Year!A:A,July!A:A,0)),\"\")","v":""},{"$f":"IFERROR(INDEX(Aug!F:F,MATCH(Year!A:A,Aug!A:A,0)),\"\")","v":""},{"$f":"IFERROR(INDEX(Sept!F:F,MATCH(Year!A:A,Sept!A:A,0)),\"\")","v":""},{"$f":"IFERROR(INDEX(Oct!F:F,MATCH(Year!A:A,Oct!A:A,0)),\"\")","v":""},{"$f":"IFERROR(INDEX(Nov!F:F,MATCH(Year!A:A,Nov!A:A,0)),\"\")","v":""},{"$f":"IFERROR(INDEX(Dec!F:F,MATCH(Year!A:A,Dec!A:A,0)),\"\")","v":""},{"$f":"IFERROR(INDEX(Jan!F:F,MATCH(Year!A:A,Jan!A:A,0)),\"\")","v":""},{"$f":"IFERROR(INDEX(Feb!F:F,MATCH(Year!A:A,Feb!A:A,0)),\"\")","v":""},{"$f":"IFERROR(INDEX(March!F:F,MATCH(Year!A:A,March!A:A,0)),\"\")","v":""},{"$f":"IF(ISERROR((SUM(B176:M176))/B4),\"\",(SUM(B176:M176))/B4)","v":0}]
[{"$f":"IF(ISERROR(Q!A33),\"\",Q!A33)","v":0},{"$f":"IFERROR(INDEX(April!F:F,MATCH(Year!A:A,April!A:A,0)),\"\")","v":""},{"$f":"IFERROR(INDEX(May!F:F,MATCH(Year!A:A,May!A:A,0)),\"\")","v":""},{"$f":"IFERROR(INDEX(June!F:F,MATCH(Year!A:A,June!A:A,0)),\"\")","v":""},{"$f":"IFERROR(INDEX(July!F:F,MATCH(Year!A:A,July!A:A,0)),\"\")","v":""},{"$f":"IFERROR(INDEX(Aug!F:F,MATCH(Year!A:A,Aug!A:A,0)),\"\")","v":""},{"$f":"IFERROR(INDEX(Sept!F:F,MATCH(Year!A:A,Sept!A:A,0)),\"\")","v":""},{"$f":"IFERROR(INDEX(Oct!F:F,MATCH(Year!A:A,Oct!A:A,0)),\"\")","v":""},{"$f":"IFERROR(INDEX(Nov!F:F,MATCH(Year!A:A,Nov!A:A,0)),\"\")","v":""},{"$f":"IFERROR(INDEX(Dec!F:F,MATCH(Year!A:A,Dec!A:A,0)),\"\")","v":""},{"$f":"IFERROR(INDEX(Jan!F:F,MATCH(Year!A:A,Jan!A:A,0)),\"\")","v":""},{"$f":"IFERROR(INDEX(Feb!F:F,MATCH(Year!A:A,Feb!A:A,0)),\"\")","v":""},{"$f":"IFERROR(INDEX(March!F:F,MATCH(Year!A:A,March!A:A,0)),\"\")","v":""},{"$f":"IF(ISERROR((SUM(B177:M177))/B4),\"\",(SUM(B177:M177))/B4)","v":0}]
[{"$f":"IF(ISERROR(Q!A34),\"\",Q!A34)","v":0},{"$f":"IFERROR(INDEX(April!F:F,MATCH(Year!A:A,April!A:A,0)),\"\")","v":""},{"$f":"IFERROR(INDEX(May!F:F,MATCH(Year!A:A,May!A:A,0)),\"\")","v":""},{"$f":"IFERROR(INDEX(June!F:F,MATCH(Year!A:A,June!A:A,0)),\"\")","v":""},{"$f":"IFERROR(INDEX(July!F:F,MATCH(Year!A:A,July!A:A,0)),\"\")","v":""},{"$f":"IFERROR(INDEX(Aug!F:F,MATCH(Year!A:A,Aug!A:A,0)),\"\")","v":""},{"$f":"IFERROR(INDEX(Sept!F:F,MATCH(Year!A:A,Sept!A:A,0)),\"\")","v":""},{"$f":"IFERROR(INDEX(Oct!F:F,MATCH(Year!A:A,Oct!A:A,0)),\"\")","v":""},{"$f":"IFERROR(INDEX(Nov!F:F,MATCH(Year!A:A,Nov!A:A,0)),\"\")","v":""},{"$f":"IFERROR(INDEX(Dec!F:F,MATCH(Year!A:A,Dec!A:A,0)),\"\")","v":""},{"$f":"IFERROR(INDEX(Jan!F:F,MATCH(Year!A:A,Jan!A:A,0)),\"\")","v":""},{"$f":"IFERROR(INDEX(Feb!F:F,MATCH(Year!A:A,Feb!A:A,0)),\"\")","v":""},{"$f":"IFERROR(INDEX(March!F:F,MATCH(Year!A:A,March!A:A,0)),\"\")","v":""},{"$f":"IF(ISERROR((SUM(B178:M178))/B4),\"\",(SUM(B178:M178))/B4)","v":0}]
[{"$f":"IF(ISERROR(Q!A35),\"\",Q!A35)","v":0},{"$f":"IFERROR(INDEX(April!F:F,MATCH(Year!A:A,April!A:A,0)),\"\")","v":""},{"$f":"IFERROR(INDEX(May!F:F,MATCH(Year!A:A,May!A:A,0)),\"\")","v":""},{"$f":"IFERROR(INDEX(June!F:F,MATCH(Year!A:A,June!A:A,0)),\"\")","v":""},{"$f":"IFERROR(INDEX(July!F:F,MATCH(Year!A:A,July!A:A,0)),\"\")","v":""},{"$f":"IFERROR(INDEX(Aug!F:F,MATCH(Year!A:A,Aug!A:A,0)),\"\")","v":""},{"$f":"IFERROR(INDEX(Sept!F:F,MATCH(Year!A:A,Sept!A:A,0)),\"\")","v":""},{"$f":"IFERROR(INDEX(Oct!F:F,MATCH(Year!A:A,Oct!A:A,0)),\"\")","v":""},{"$f":"IFERROR(INDEX(Nov!F:F,MATCH(Year!A:A,Nov!A:A,0)),\"\")","v":""},{"$f":"IFERROR(INDEX(Dec!F:F,MATCH(Year!A:A,Dec!A:A,0)),\"\")","v":""},{"$f":"IFERROR(INDEX(Jan!F:F,MATCH(Year!A:A,Jan!A:A,0)),\"\")","v":""},{"$f":"IFERROR(INDEX(Feb!F:F,MATCH(Year!A:A,Feb!A:A,0)),\"\")","v":""},{"$f":"IFERROR(INDEX(March!F:F,MATCH(Year!A:A,March!A:A,0)),\"\")","v":""},{"$f":"IF(ISERROR((SUM(B179:M179))/B4),\"\",(SUM(B179:M179))/B4)","v":0}]
[{"$f":"IF(ISERROR(Q!A36),\"\",Q!A36)","v":0},{"$f":"IFERROR(INDEX(April!F:F,MATCH(Year!A:A,April!A:A,0)),\"\")","v":""},{"$f":"IFERROR(INDEX(May!F:F,MATCH(Year!A:A,May!A:A,0)),\"\")","v":""},{"$f":"IFERROR(INDEX(June!F:F,MATCH(Year!A:A,June!A:A,0)),\"\")","v":""},{"$f":"IFERROR(INDEX(July!F:F,MATCH(Year!A:A,July!A:A,0)),\"\")","v":""},{"$f":"IFERROR(INDEX(Aug!F:F,MATCH(Year!A:A,Aug!A:A,0)),\"\")","v":""},{"$f":"IFERROR(INDEX(Sept!F:F,MATCH(Year!A:A,Sept!A:A,0)),\"\")","v":""},{"$f":"IFERROR(INDEX(Oct!F:F,MATCH(Year!A:A,Oct!A:A,0)),\"\")","v":""},{"$f":"IFERROR(INDEX(Nov!F:F,MATCH(Year!A:A,Nov!A:A,0)),\"\")","v":""},{"$f":"IFERROR(INDEX(Dec!F:F,MATCH(Year!A:A,Dec!A:A,0)),\"\")","v":""},{"$f":"IFERROR(INDEX(Jan!F:F,MATCH(Year!A:A,Jan!A:A,0)),\"\")","v":""},{"$f":"IFERROR(INDEX(Feb!F:F,MATCH(Year!A:A,Feb!A:A,0)),\"\")","v":""},{"$f":"IFERROR(INDEX(March!F:F,MATCH(Year!A:A,March!A:A,0)),\"\")","v":""},{"$f":"IF(ISERROR((SUM(B180:M180))/B4),\"\",(SUM(B180:M180))/B4)","v":0}]
[{"$f":"IF(ISERROR(Q!A37),\"\",Q!A37)","v":0},{"$f":"IFERROR(INDEX(April!F:F,MATCH(Year!A:A,April!A:A,0)),\"\")","v":""},{"$f":"IFERROR(INDEX(May!F:F,MATCH(Year!A:A,May!A:A,0)),\"\")","v":""},{"$f":"IFERROR(INDEX(June!F:F,MATCH(Year!A:A,June!A:A,0)),\"\")","v":""},{"$f":"IFERROR(INDEX(July!F:F,MATCH(Year!A:A,July!A:A,0)),\"\")","v":""},{"$f":"IFERROR(INDEX(Aug!F:F,MATCH(Year!A:A,Aug!A:A,0)),\"\")","v":""},{"$f":"IFERROR(INDEX(Sept!F:F,MATCH(Year!A:A,Sept!A:A,0)),\"\")","v":""},{"$f":"IFERROR(INDEX(Oct!F:F,MATCH(Year!A:A,Oct!A:A,0)),\"\")","v":""},{"$f":"IFERROR(INDEX(Nov!F:F,MATCH(Year!A:A,Nov!A:A,0)),\"\")","v":""},{"$f":"IFERROR(INDEX(Dec!F:F,MATCH(Year!A:A,Dec!A:A,0)),\"\")","v":""},{"$f":"IFERROR(INDEX(Jan!F:F,MATCH(Year!A:A,Jan!A:A,0)),\"\")","v":""},{"$f":"IFERROR(INDEX(Feb!F:F,MATCH(Year!A:A,Feb!A:A,0)),\"\")","v":""},{"$f":"IFERROR(INDEX(March!F:F,MATCH(Year!A:A,March!A:A,0)),\"\")","v":""},{"$f":"IF(ISERROR((SUM(B181:M181))/B4),\"\",(SUM(B181:M181))/B4)","v":0}]
[{"$f":"IF(ISERROR(Q!A38),\"\",Q!A38)","v":0},{"$f":"IFERROR(INDEX(April!F:F,MATCH(Year!A:A,April!A:A,0)),\"\")","v":""},{"$f":"IFERROR(INDEX(May!F:F,MATCH(Year!A:A,May!A:A,0)),\"\")","v":""},{"$f":"IFERROR(INDEX(June!F:F,MATCH(Year!A:A,June!A:A,0)),\"\")","v":""},{"$f":"IFERROR(INDEX(July!F:F,MATCH(Year!A:A,July!A:A,0)),\"\")","v":""},{"$f":"IFERROR(INDEX(Aug!F:F,MATCH(Year!A:A,Aug!A:A,0)),\"\")","v":""},{"$f":"IFERROR(INDEX(Sept!F:F,MATCH(Year!A:A,Sept!A:A,0)),\"\")","v":""},{"$f":"IFERROR(INDEX(Oct!F:F,MATCH(Year!A:A,Oct!A:A,0)),\"\")","v":""},{"$f":"IFERROR(INDEX(Nov!F:F,MATCH(Year!A:A,Nov!A:A,0)),\"\")","v":""},{"$f":"IFERROR(INDEX(Dec!F:F,MATCH(Year!A:A,Dec!A:A,0)),\"\")","v":""},{"$f":"IFERROR(INDEX(Jan!F:F,MATCH(Year!A:A,Jan!A:A,0)),\"\")","v":""},{"$f":"IFERROR(INDEX(Feb!F:F,MATCH(Year!A:A,Feb!A:A,0)),\"\")","v":""},{"$f":"IFERROR(INDEX(March!F:F,MATCH(Year!A:A,March!A:A,0)),\"\")","v":""},{"$f":"IF(ISERROR((SUM(B182:M182))/B4),\"\",(SUM(B182:M182))/B4)","v":0}]
[{"$f":"IF(ISERROR(Q!A39),\"\",Q!A39)","v":0},{"$f":"IFERROR(INDEX(April!F:F,MATCH(Year!A:A,April!A:A,0)),\"\")","v":""},{"$f":"IFERROR(INDEX(May!F:F,MATCH(Year!A:A,May!A:A,0)),\"\")","v":""},{"$f":"IFERROR(INDEX(June!F:F,MATCH(Year!A:A,June!A:A,0)),\"\")","v":""},{"$f":"IFERROR(INDEX(July!F:F,MATCH(Year!A:A,July!A:A,0)),\"\")","v":""},{"$f":"IFERROR(INDEX(Aug!F:F,MATCH(Year!A:A,Aug!A:A,0)),\"\")","v":""},{"$f":"IFERROR(INDEX(Sept!F:F,MATCH(Year!A:A,Sept!A:A,0)),\"\")","v":""},{"$f":"IFERROR(INDEX(Oct!F:F,MATCH(Year!A:A,Oct!A:A,0)),\"\")","v":""},{"$f":"IFERROR(INDEX(Nov!F:F,MATCH(Year!A:A,Nov!A:A,0)),\"\")","v":""},{"$f":"IFERROR(INDEX(Dec!F:F,MATCH(Year!A:A,Dec!A:A,0)),\"\")","v":""},{"$f":"IFERROR(INDEX(Jan!F:F,MATCH(Year!A:A,Jan!A:A,0)),\"\")","v":""},{"$f":"IFERROR(INDEX(Feb!F:F,MATCH(Year!A:A,Feb!A:A,0)),\"\")","v":""},{"$f":"IFERROR(INDEX(March!F:F,MATCH(Year!A:A,March!A:A,0)),\"\")","v":""},{"$f":"IF(ISERROR((SUM(B183:M183))/B4),\"\",(SUM(B183:M183))/B4)","v":0}]
[{"$f":"IF(ISERROR(Q!A40),\"\",Q!A40)","v":0},{"$f":"IFERROR(INDEX(April!F:F,MATCH(Year!A:A,April!A:A,0)),\"\")","v":""},{"$f":"IFERROR(INDEX(May!F:F,MATCH(Year!A:A,May!A:A,0)),\"\")","v":""},{"$f":"IFERROR(INDEX(June!F:F,MATCH(Year!A:A,June!A:A,0)),\"\")","v":""},{"$f":"IFERROR(INDEX(July!F:F,MATCH(Year!A:A,July!A:A,0)),\"\")","v":""},{"$f":"IFERROR(INDEX(Aug!F:F,MATCH(Year!A:A,Aug!A:A,0)),\"\")","v":""},{"$f":"IFERROR(INDEX(Sept!F:F,MATCH(Year!A:A,Sept!A:A,0)),\"\")","v":""},{"$f":"IFERROR(INDEX(Oct!F:F,MATCH(Year!A:A,Oct!A:A,0)),\"\")","v":""},{"$f":"IFERROR(INDEX(Nov!F:F,MATCH(Year!A:A,Nov!A:A,0)),\"\")","v":""},{"$f":"IFERROR(INDEX(Dec!F:F,MATCH(Year!A:A,Dec!A:A,0)),\"\")","v":""},{"$f":"IFERROR(INDEX(Jan!F:F,MATCH(Year!A:A,Jan!A:A,0)),\"\")","v":""},{"$f":"IFERROR(INDEX(Feb!F:F,MATCH(Year!A:A,Feb!A:A,0)),\"\")","v":""},{"$f":"IFERROR(INDEX(March!F:F,MATCH(Year!A:A,March!A:A,0)),\"\")","v":""},{"$f":"IF(ISERROR((SUM(B184:M184))/B4),\"\",(SUM(B184:M184))/B4)","v":0}]
[{"$f":"IF(ISERROR(Q!A41),\"\",Q!A41)","v":0},{"$f":"IFERROR(INDEX(April!F:F,MATCH(Year!A:A,April!A:A,0)),\"\")","v":""},{"$f":"IFERROR(INDEX(May!F:F,MATCH(Year!A:A,May!A:A,0)),\"\")","v":""},{"$f":"IFERROR(INDEX(June!F:F,MATCH(Year!A:A,June!A:A,0)),\"\")","v":""},{"$f":"IFERROR(INDEX(July!F:F,MATCH(Year!A:A,July!A:A,0)),\"\")","v":""},{"$f":"IFERROR(INDEX(Aug!F:F,MATCH(Year!A:A,Aug!A:A,0)),\"\")","v":""},{"$f":"IFERROR(INDEX(Sept!F:F,MATCH(Year!A:A,Sept!A:A,0)),\"\")","v":""},{"$f":"IFERROR(INDEX(Oct!F:F,MATCH(Year!A:A,Oct!A:A,0)),\"\")","v":""},{"$f":"IFERROR(INDEX(Nov!F:F,MATCH(Year!A:A,Nov!A:A,0)),\"\")","v":""},{"$f":"IFERROR(INDEX(Dec!F:F,MATCH(Year!A:A,Dec!A:A,0)),\"\")","v":""},{"$f":"IFERROR(INDEX(Jan!F:F,MATCH(Year!A:A,Jan!A:A,0)),\"\")","v":""},{"$f":"IFERROR(INDEX(Feb!F:F,MATCH(Year!A:A,Feb!A:A,0)),\"\")","v":""},{"$f":"IFERROR(INDEX(March!F:F,MATCH(Year!A:A,March!A:A,0)),\"\")","v":""},{"$f":"IF(ISERROR((SUM(B185:M185))/B4),\"\",(SUM(B185:M185))/B4)","v":0}]
["Average",{"$f":"IF(ISERROR((SUM(B146:B185)/April!B8)),\"\",(SUM(B146:B185)/April!B8))","v":5.4545454545454557E-2},{"$f":"IF(ISERROR((SUM(C146:C185)/May!B8)),\"\",(SUM(C146:C185)/May!B8))","v":6.8181818181818177E-2},{"$f":"IF(ISERROR((SUM(D146:D185)/June!B8)),\"\",(SUM(D146:D185)/June!B8))","v":1.8181818181818184E-2},{"$f":"IF(ISERROR((SUM(E146:E185)/July!B8)),\"\",(SUM(E146:E185)/July!B8))","v":1.8181818181818184E-2},{"$f":"IF(ISERROR((SUM(F146:F185)/Aug!B8)),\"\",(SUM(F146:F185)/Aug!B8))","v":1.8181818181818184E-2},{"$f":"IF(ISERROR((SUM(G146:G185)/Sept!B8)),\"\",(SUM(G146:G185)/Sept!B8))","v":2.2727272727272728E-2},{"$f":"IF(ISERROR((SUM(H146:H185)/Oct!B8)),\"\",(SUM(H146:H185)/Oct!B8))","v":0},{"$f":"IF(ISERROR((SUM(I146:I185)/Nov!B8)),\"\",(SUM(I146:I185)/Nov!B8))","v":2.2727272727272728E-2},{"$f":"IF(ISERROR((SUM(J146:J185)/Dec!B8)),\"\",(SUM(J146:J185)/Dec!B8))","v":3.6363636363636369E-2},{"$f":"IF(ISERROR((SUM(K146:K185)/Jan!B8)),\"\",(SUM(K146:K185)/Jan!B8))","v":3.03030303030303E-2},{"$f":"IF(ISERROR((SUM(L146:L185)/Feb!B8)),\"\",(SUM(L146:L185)/Feb!B8))","v":5.909090909090909E-2},{"$f":"IF(ISERROR((SUM(M146:M185)/March!B8)),\"\",(SUM(M146:M185)/March!B8))","v":3.03030303030303E-2}]

{"sheet":"Process Updates","index":4,"n_rows":59,"n_cols":2,"rows_kept":59,"cut":false,"hidden":false,"merged":[[24,1,26,8],[1,1,1,8],[4,1,6,8],[9,1,11,8],[14,1,16,8],[19,1,21,8],[59,1,61,8],[29,1,31,8],[34,1,36,8],[39,1,41,8],[44,1,46,8],[49,1,51,8],[54,1,56,8]]}
[]
[null,"Please detail any changes made to the audited process (following each audit) below:"]
[]
[null,"April:"]
[null,"e.g:extra option added to notes template"]
[]
[]
[]
[null,"May:"]
[]
[]
[]
[]
[null,"June:"]
[]
[]
[]
[]
[null,"July:"]
[]
[]
[]
[]
[null,"August:"]
[]
[]
[]
[]
[null,"September:"]
[]
[]
[]
[]
[null,"October:"]
[]
[]
[]
[]
[null,"November:"]
[]
[]
[]
[]
[null,"December:"]
[]
[]
[]
[]
[null,"January:"]
[]
[]
[]
[]
[null,"February:"]
[]
[]
[]
[]
[null,"March:"]

{"sheet":"Graphs","index":5,"n_rows":18,"n_cols":2,"rows_kept":18,"cut":false,"hidden":false,"merged":[]}
[]
[]
[]
[]
[]
[]
[]
[]
[]
[]
[]
[]
[]
[]
[]
[]
[]
[null,"Questions listed can be filtered by clicking on the graph & selecting the filter Icon"]

{"sheet":"April","index":6,"n_rows":51,"n_cols":8,"rows_kept":51,"cut":false,"hidden":false,"merged":[]}
["Click here to go to year overview"]
[]
["Date",null,null,"Total by Apt type"]
["Completed by",null,null,"New",{"$f":"COUNTIF('Apr-Raw'!E3:E103,\"New\")","v":5}]
["Sample group size",{"$f":"COUNTA('Apr-Raw'!A:A)-2","v":5},null,"Follow up",{"$f":"COUNTIF('Apr-Raw'!E3:E103,\"Fup\")","v":0},null,null,{"$f":"Year!H5","v":0.95}]
["Overall Result (compliant only)",{"$f":"IF(ISERROR(SUM(D11:D50)/G51),\"\",SUM(D11:D50)/G51)","v":0.87272727272727257},null,"Total by apt Code",null,null,null,{"$f":"Year!H6","v":"80-95%"}]
["Overall Result (compliant & Justified)",{"$f":"IF(ISERROR(SUM(C11:C50)/G51),\"\",SUM(C11:C50)/G51)","v":0.94545454545454533},null,"code goes in here",{"$f":"COUNTIF('Apr-Raw'!F3:F103,D7)","v":0},null,null,{"$f":"Year!H7","v":0.8}]
["viable qs",{"$f":"G51","v":11}]
[]
["Metric","Target %","Compliant + Justified","Compliant","Justified","Not compliant","Irritating math"]
[{"$f":"IF(ISERROR(Q!A2),\"\",Q!A2)","v":"Was a Room number documented?"},{"$f":"IF(ISERROR(Q!B2),\"\",Q!B2)","v":0},{"$f":"IF(ISERROR(D11+E11),\"\",D11+E11)","v":1},{"$f":"'Apr-Data'!B10","v":1},{"$f":"'Apr-Data'!B12","v":0},{"$f":"'Apr-Data'!B11","v":0},{"$f":"COUNTIF(D11:F11,\">0\")","v":1}]
[{"$f":"IF(ISERROR(Q!A3),\"\",Q!A3)","v":"Were stage A checks completed as appropriate?"},{"$f":"IF(ISERROR(Q!B3),\"\",Q!B3)","v":0},1,{"$f":"'Apr-Data'!C10","v":1},{"$f":"'Apr-Data'!C12","v":0},{"$f":"'Apr-Data'!C11","v":0},1]
[{"$f":"IF(ISERROR(Q!A4),\"\",Q!A4)","v":"Was COSI Part 1 performed?"},{"$f":"IF(ISERROR(Q!B4),\"\",Q!B4)","v":0},0.6,{"$f":"'Apr-Data'!D10","v":0.6},{"$f":"'Apr-Data'!D12","v":0},{"$f":"'Apr-Data'!D11","v":0.4},2]
[{"$f":"IF(ISERROR(Q!A5),\"\",Q!A5)","v":"Was PVP documented?"},{"$f":"IF(ISERROR(Q!B5),\"\",Q!B5)","v":0},1,{"$f":"'Apr-Data'!E10","v":1},{"$f":"'Apr-Data'!E12","v":0},{"$f":"'Apr-Data'!E11","v":0},1]
[{"$f":"IF(ISERROR(Q!A6),\"\",Q!A6)","v":"Was Otoscopy documented?"},{"$f":"IF(ISERROR(Q!B6),\"\",Q!B6)","v":0},1,{"$f":"'Apr-Data'!F10","v":1},{"$f":"'Apr-Data'!F12","v":0},{"$f":"'Apr-Data'!F11","v":0},1]
[{"$f":"IF(ISERROR(Q!A7),\"\",Q!A7)","v":"Document bc at 3 & 4kHz is for programming purposes?"},{"$f":"IF(ISERROR(Q!B7),\"\",Q!B7)","v":0},1,{"$f":"'Apr-Data'!G10","v":1},{"$f":"'Apr-Data'!G12","v":0},{"$f":"'Apr-Data'!G11","v":0},1]
[{"$f":"IF(ISERROR(Q!A8),\"\",Q!A8)","v":"Was Speech testing performed?"},{"$f":"IF(ISERROR(Q!B8),\"\",Q!B8)","v":0},1,{"$f":"'Apr-Data'!H10","v":0.6},{"$f":"'Apr-Data'!H12","v":0.4},{"$f":"'Apr-Data'!H11","v":0},2]
[{"$f":"IF(ISERROR(Q!A9),\"\",Q!A9)","v":"Is it documented whether national criteria were/were not met?"},{"$f":"IF(ISERROR(Q!B9),\"\",Q!B9)","v":0},0.8,{"$f":"'Apr-Data'!I10","v":0.8},{"$f":"'Apr-Data'!I12","v":0},{"$f":"'Apr-Data'!I11","v":0.2},2]
[{"$f":"IF(ISERROR(Q!A10),\"\",Q!A10)","v":"Was a BCHI info pack supplied?"},{"$f":"IF(ISERROR(Q!B10),\"\",Q!B10)","v":0},1,{"$f":"'Apr-Data'!J10","v":0.6},{"$f":"'Apr-Data'!J12","v":0.4},{"$f":"'Apr-Data'!J11","v":0},2]
[{"$f":"IF(ISERROR(Q!A11),\"\",Q!A11)","v":"Was the report authorised & issued within target (7 days)?"},{"$f":"IF(ISERROR(Q!B11),\"\",Q!B11)","v":0},1,{"$f":"'Apr-Data'!K10","v":1},{"$f":"'Apr-Data'!K12","v":0},{"$f":"'Apr-Data'!K11","v":0},1]
[{"$f":"IF(ISERROR(Q!A12),\"\",Q!A12)","v":"Was consent documented as appropriate?"},{"$f":"IF(ISERROR(Q!B12),\"\",Q!B12)","v":0},1,{"$f":"'Apr-Data'!L10","v":1},{"$f":"'Apr-Data'!L12","v":0},{"$f":"'Apr-Data'!L11","v":0},1]
[{"$f":"IF(ISERROR(Q!A13),\"\",Q!A13)","v":0},{"$f":"IF(ISERROR(Q!B13),\"\",Q!B13)","v":0},"",{"$f":"'Apr-Data'!M10","v":""},{"$f":"'Apr-Data'!M12","v":""},{"$f":"'Apr-Data'!M11","v":""},0]
[{"$f":"IF(ISERROR(Q!A14),\"\",Q!A14)","v":0},{"$f":"IF(ISERROR(Q!B14),\"\",Q!B14)","v":0},"",{"$f":"'Apr-Data'!N10","v":""},{"$f":"'Apr-Data'!N12","v":""},{"$f":"'Apr-Data'!N11","v":""},0]
[{"$f":"IF(ISERROR(Q!A15),\"\",Q!A15)","v":0},{"$f":"IF(ISERROR(Q!B15),\"\",Q!B15)","v":0},"",{"$f":"'Apr-Data'!O10","v":""},{"$f":"'Apr-Data'!O12","v":""},{"$f":"'Apr-Data'!O11","v":""},0]
[{"$f":"IF(ISERROR(Q!A16),\"\",Q!A16)","v":0},{"$f":"IF(ISERROR(Q!B16),\"\",Q!B16)","v":0},"",{"$f":"'Apr-Data'!P10","v":""},{"$f":"'Apr-Data'!P12","v":""},{"$f":"'Apr-Data'!P11","v":""},0]
[{"$f":"IF(ISERROR(Q!A17),\"\",Q!A17)","v":0},{"$f":"IF(ISERROR(Q!B17),\"\",Q!B17)","v":0},"",{"$f":"'Apr-Data'!Q10","v":""},{"$f":"'Apr-Data'!Q12","v":""},{"$f":"'Apr-Data'!Q11","v":""},0]
[{"$f":"IF(ISERROR(Q!A18),\"\",Q!A18)","v":0},{"$f":"IF(ISERROR(Q!B18),\"\",Q!B18)","v":0},"",{"$f":"'Apr-Data'!R10","v":""},{"$f":"'Apr-Data'!R12","v":""},{"$f":"'Apr-Data'!R11","v":""},0]
[{"$f":"IF(ISERROR(Q!A19),\"\",Q!A19)","v":0},{"$f":"IF(ISERROR(Q!B19),\"\",Q!B19)","v":0},"",{"$f":"'Apr-Data'!S10","v":""},{"$f":"'Apr-Data'!S12","v":""},{"$f":"'Apr-Data'!S11","v":""},0]
[{"$f":"IF(ISERROR(Q!A20),\"\",Q!A20)","v":0},{"$f":"IF(ISERROR(Q!B20),\"\",Q!B20)","v":0},"",{"$f":"'Apr-Data'!T10","v":""},{"$f":"'Apr-Data'!T12","v":""},{"$f":"'Apr-Data'!T11","v":""},0]
[{"$f":"IF(ISERROR(Q!A21),\"\",Q!A21)","v":0},{"$f":"IF(ISERROR(Q!B21),\"\",Q!B21)","v":0},"",{"$f":"'Apr-Data'!U10","v":""},{"$f":"'Apr-Data'!U12","v":""},{"$f":"'Apr-Data'!U11","v":""},0]
[{"$f":"IF(ISERROR(Q!A22),\"\",Q!A22)","v":0},{"$f":"IF(ISERROR(Q!B22),\"\",Q!B22)","v":0},"",{"$f":"'Apr-Data'!V10","v":""},{"$f":"'Apr-Data'!V12","v":""},{"$f":"'Apr-Data'!V11","v":""},0]
[{"$f":"IF(ISERROR(Q!A23),\"\",Q!A23)","v":0},{"$f":"IF(ISERROR(Q!B23),\"\",Q!B23)","v":0},"",{"$f":"'Apr-Data'!W10","v":""},{"$f":"'Apr-Data'!W12","v":""},{"$f":"'Apr-Data'!W11","v":""},0]
[{"$f":"IF(ISERROR(Q!A24),\"\",Q!A24)","v":0},{"$f":"IF(ISERROR(Q!B24),\"\",Q!B24)","v":0},"",{"$f":"'Apr-Data'!X10","v":""},{"$f":"'Apr-Data'!X12","v":""},{"$f":"'Apr-Data'!X11","v":""},0]
[{"$f":"IF(ISERROR(Q!A25),\"\",Q!A25)","v":0},{"$f":"IF(ISERROR(Q!B25),\"\",Q!B25)","v":0},"",{"$f":"'Apr-Data'!Y10","v":""},{"$f":"'Apr-Data'!Y12","v":""},{"$f":"'Apr-Data'!Y11","v":""},0]
[{"$f":"IF(ISERROR(Q!A26),\"\",Q!A26)","v":0},{"$f":"IF(ISERROR(Q!B26),\"\",Q!B26)","v":0},"",{"$f":"'Apr-Data'!Z10","v":""},{"$f":"'Apr-Data'!Z12","v":""},{"$f":"'Apr-Data'!Z11","v":""},0]
[{"$f":"IF(ISERROR(Q!A27),\"\",Q!A27)","v":0},{"$f":"IF(ISERROR(Q!B27),\"\",Q!B27)","v":0},"",{"$f":"'Apr-Data'!AA10","v":""},{"$f":"'Apr-Data'!AA12","v":""},{"$f":"'Apr-Data'!AA11","v":""},0]
[{"$f":"IF(ISERROR(Q!A28),\"\",Q!A28)","v":0},{"$f":"IF(ISERROR(Q!B28),\"\",Q!B28)","v":0},"",{"$f":"'Apr-Data'!AB10","v":""},{"$f":"'Apr-Data'!AB12","v":""},{"$f":"'Apr-Data'!AB11","v":""},0]
[{"$f":"IF(ISERROR(Q!A29),\"\",Q!A29)","v":0},{"$f":"IF(ISERROR(Q!B29),\"\",Q!B29)","v":0},"",{"$f":"'Apr-Data'!AC10","v":""},{"$f":"'Apr-Data'!AC12","v":""},{"$f":"'Apr-Data'!AC11","v":""},0]
[{"$f":"IF(ISERROR(Q!A30),\"\",Q!A30)","v":0},{"$f":"IF(ISERROR(Q!B30),\"\",Q!B30)","v":0},"",{"$f":"'Apr-Data'!AD10","v":""},{"$f":"'Apr-Data'!AD12","v":""},{"$f":"'Apr-Data'!AD11","v":""},0]
[{"$f":"IF(ISERROR(Q!A31),\"\",Q!A31)","v":0},{"$f":"IF(ISERROR(Q!B31),\"\",Q!B31)","v":0},"",{"$f":"'Apr-Data'!AE10","v":""},{"$f":"'Apr-Data'!AE12","v":""},{"$f":"'Apr-Data'!AE11","v":""},0]
[{"$f":"IF(ISERROR(Q!A32),\"\",Q!A32)","v":0},{"$f":"IF(ISERROR(Q!B32),\"\",Q!B32)","v":0},"",{"$f":"'Apr-Data'!AF10","v":""},{"$f":"'Apr-Data'!AF12","v":""},{"$f":"'Apr-Data'!AF11","v":""},0]
[{"$f":"IF(ISERROR(Q!A33),\"\",Q!A33)","v":0},{"$f":"IF(ISERROR(Q!B33),\"\",Q!B33)","v":0},"",{"$f":"'Apr-Data'!AG10","v":""},{"$f":"'Apr-Data'!AG12","v":""},{"$f":"'Apr-Data'!AG11","v":""},0]
[{"$f":"IF(ISERROR(Q!A34),\"\",Q!A34)","v":0},{"$f":"IF(ISERROR(Q!B34),\"\",Q!B34)","v":0},"",{"$f":"'Apr-Data'!AH10","v":""},{"$f":"'Apr-Data'!AH12","v":""},{"$f":"'Apr-Data'!AH11","v":""},0]
[{"$f":"IF(ISERROR(Q!A35),\"\",Q!A35)","v":0},{"$f":"IF(ISERROR(Q!B35),\"\",Q!B35)","v":0},"",{"$f":"'Apr-Data'!AI10","v":""},{"$f":"'Apr-Data'!AI12","v":""},{"$f":"'Apr-Data'!AI11","v":""},0]
[{"$f":"IF(ISERROR(Q!A36),\"\",Q!A36)","v":0},{"$f":"IF(ISERROR(Q!B36),\"\",Q!B36)","v":0},"",{"$f":"'Apr-Data'!AJ10","v":""},{"$f":"'Apr-Data'!AJ12","v":""},{"$f":"'Apr-Data'!AJ11","v":""},0]
[{"$f":"IF(ISERROR(Q!A37),\"\",Q!A37)","v":0},{"$f":"IF(ISERROR(Q!B37),\"\",Q!B37)","v":0},"",{"$f":"'Apr-Data'!AK10","v":""},{"$f":"'Apr-Data'!AK12","v":""},{"$f":"'Apr-Data'!AK11","v":""},0]
[{"$f":"IF(ISERROR(Q!A38),\"\",Q!A38)","v":0},{"$f":"IF(ISERROR(Q!B38),\"\",Q!B38)","v":0},"",{"$f":"'Apr-Data'!AL10","v":""},{"$f":"'Apr-Data'!AL12","v":""},{"$f":"'Apr-Data'!AL11","v":""},0]
[{"$f":"IF(ISERROR(Q!A39),\"\",Q!A39)","v":0},{"$f":"IF(ISERROR(Q!B39),\"\",Q!B39)","v":0},"",{"$f":"'Apr-Data'!AM10","v":""},{"$f":"'Apr-Data'!AM12","v":""},{"$f":"'Apr-Data'!AM11","v":""},0]
[{"$f":"IF(ISERROR(Q!A40),\"\",Q!A40)","v":0},{"$f":"IF(ISERROR(Q!B40),\"\",Q!B40)","v":0},"",{"$f":"'Apr-Data'!AN10","v":""},{"$f":"'Apr-Data'!AN12","v":""},{"$f":"'Apr-Data'!AN11","v":""},0]
[{"$f":"IF(ISERROR(Q!A41),\"\",Q!A41)","v":0},{"$f":"IF(ISERROR(Q!B41),\"\",Q!B41)","v":0},"",{"$f":"'Apr-Data'!AO10","v":""},{"$f":"'Apr-Data'!AO12","v":""},{"$f":"'Apr-Data'!AO11","v":""},0]
[null,null,null,null,null,null,{"$f":"COUNTIF(G11:G50,\">=1\")","v":11}]

{"sheet":"Apr-Raw","index":7,"n_rows":7,"n_cols":87,"rows_kept":7,"cut":false,"hidden":true,"merged":[[0,85,0,86],[0,63,0,64],[0,65,0,66],[0,67,0,68],[0,69,0,70],[0,71,0,72],[0,73,0,74],[0,75,0,76],[0,77,0,78],[0,79,0,80],[0,81,0,82],[0,83,0,84],[0,61,0,62],[0,39,0,40],[0,41,0,42],[0,43,0,44],[0,45,0,46],[0,47,0,48],[0,49,0,50],[0,51,0,52],[0,53,0,54],[0,55,0,56],[0,57,0,58],[0,59,0,60],[0,37,0,38],[0,15,0,16],[0,17,0,18],[0,19,0,20],[0,21,0,22],[0,23,0,24],[0,25,0,26],[0,27,0,28],[0,29,0,30],[0,31,0,32],[0,33,0,34],[0,35,0,36],[0,13,0,14],[0,0,0,5],[0,6,1,6],[0,7,0,8],[0,9,0,10],[0,11,0,12]]}
["Record details",null,null,null,null,null,"Notes",{"$f":"Q!A2","v":"Was a Room number documented?"},null,{"$f":"Q!A3","v":"Were stage A checks completed as appropriate?"},null,{"$f":"Q!A4","v":"Was COSI Part 1 performed?"},null,{"$f":"Q!A5","v":"Was PVP documented?"},null,{"$f":"Q!A6","v":"Was Otoscopy documented?"},null,{"$f":"Q!A7","v":"Document bc at 3 & 4kHz is for programming purposes?"},null,{"$f":"Q!A8","v":"Was Speech testing performed?"},null,{"$f":"Q!A9","v":"Is it documented whether national criteria were/were not met?"},null,{"$f":"Q!A10","v":"Was a BCHI info pack supplied?"},null,{"$f":"Q!A11","v":"Was the report authorised & issued within target (7 days)?"},null,{"$f":"Q!A12","v":"Was consent documented as appropriate?"},null,{"$f":"Q!A13","v":0},null,{"$f":"Q!A14","v":0},null,{"$f":"Q!A15","v":0},null,{"$f":"Q!A16","v":0},null,{"$f":"Q!A17","v":0},null,{"$f":"Q!A18","v":0},null,{"$f":"Q!A19","v":0},null,{"$f":"Q!A20","v":0},null,{"$f":"Q!A21","v":0},null,{"$f":"Q!A22","v":0},null,{"$f":"Q!A23","v":0},null,{"$f":"Q!A24","v":0},null,{"$f":"Q!A25","v":0},null,{"$f":"Q!A26","v":0},null,{"$f":"Q!A27","v":0},null,{"$f":"Q!A28","v":0},null,{"$f":"Q!A29","v":0},null,{"$f":"Q!A30","v":0},null,{"$f":"Q!A31","v":0},null,{"$f":"Q!A32","v":0},null,{"$f":"Q!A33","v":0},null,{"$f":"Q!A34","v":0},null,{"$f":"Q!A35","v":0},null,{"$f":"Q!A36","v":0},null,{"$f":"Q!A37","v":0},null,{"$f":"Q!A38","v":0},null,{"$f":"Q!A39","v":0},null,{"$f":"Q!A40","v":0},null,{"$f":"Q!A41","v":0}]
["Pt number","Date seen","Clinician 1","clinician 2","New/ F-up","Apt code",null,"Compliant?","Other result","Compliant?","Other result","Compliant?","Other result","Compliant?","Other result","Compliant?","Other result","Compliant?","Other result","Compliant?","Other result","Compliant?","Other result","Compliant?","Other result","Compliant?","Other result","Compliant?","Other result","Compliant?","Other result","Compliant?","Other result","Compliant?","Other result","Compliant?","Other result","Compliant?","Other result","Compliant?","Other result","Compliant?","Other result","Compliant?","Other result","Compliant?","Other result","Compliant?","Other result","Compliant?","Other result","Compliant?","Other result","Compliant?","Other result","Compliant?","Other result","Compliant?","Other result","Compliant?","Other result","Compliant?","Other result","Compliant?","Other result","Compliant?","Other result","Compliant?","Other result","Compliant?","Other result","Compliant?","Other result","Compliant?","Other result","Compliant?","Other result","Compliant?","Other result","Compliant?","Other result","Compliant?","Other result","Compliant?","Other result","Compliant?","Other result"]
["AB0001","2023-04-04","AA",null,"New","BA",null,"Yes",null,"Yes",null,"No","said it was, but it wasn't","Yes",null,"Yes",null,"Yes",null,"Yes",null,"Yes",null,"Yes",null,"Yes",null,"Yes"]
["AB0002","17/04/2023","AA",null,"New","BA",null,"Yes",null,"Yes",null,"No","Said it was, but it wasn't","Yes",null,"Yes",null,"Yes",null,"Justified","Pt declined BCHI","Yes",null,"Justified","Pt not proceeding","Yes",null,"Yes"]
["AB0003","24/04/2023","BB",null,"New","BA",null,"Yes",null,"Yes",null,"Yes",null,"Yes",null,"Yes",null,"Yes",null,"Yes",null,"Yes",null,"Yes",null,"Yes",null,"Yes"]
["AB0004","26/04/2023","BB",null,"New","BA",null,"Yes",null,"Yes",null,"Yes",null,"Yes",null,"Yes",null,"Yes",null,"Justified","Pt declined BCHI","No",null,"Justified","Pt declined BCHI","Yes",null,"Yes"]
["AB0005","28/04/2023","CC",null,"New","BA",null,"Yes",null,"Yes",null,"Yes",null,"Yes",null,"Yes",null,"Yes",null,"Yes",null,"Yes",null,"Yes",null,"Yes",null,"Yes"]

{"sheet":"Apr-Data","index":8,"n_rows":12,"n_cols":41,"rows_kept":12,"cut":false,"hidden":true,"merged":[[0,0,1,0]]}
["Results",{"$f":"Q!A2","v":"Was a Room number documented?"},{"$f":"Q!A3","v":"Were stage A checks completed as appropriate?"},{"$f":"Q!A4","v":"Was COSI Part 1 performed?"},{"$f":"Q!A5","v":"Was PVP documented?"},{"$f":"Q!A6","v":"Was Otoscopy documented?"},{"$f":"Q!A7","v":"Document bc at 3 & 4kHz is for programming purposes?"},{"$f":"Q!A8","v":"Was Speech testing performed?"},{"$f":"Q!A9","v":"Is it documented whether national criteria were/were not met?"},{"$f":"Q!A10","v":"Was a BCHI info pack supplied?"},{"$f":"Q!A11","v":"Was the report authorised & issued within target (7 days)?"},{"$f":"Q!A12","v":"Was consent documented as appropriate?"},{"$f":"Q!A13","v":0},{"$f":"Q!A14","v":0},{"$f":"Q!A15","v":0},{"$f":"Q!A16","v":0},{"$f":"Q!A17","v":0},{"$f":"Q!A18","v":0},{"$f":"Q!A19","v":0},{"$f":"Q!A20","v":0},{"$f":"Q!A21","v":0},{"$f":"Q!A22","v":0},{"$f":"Q!A23","v":0},{"$f":"Q!A24","v":0},{"$f":"Q!A25","v":0},{"$f":"Q!A26","v":0},{"$f":"Q!A27","v":0},{"$f":"Q!A28","v":0},{"$f":"Q!A29","v":0},{"$f":"Q!A30","v":0},{"$f":"Q!A31","v":0},{"$f":"Q!A32","v":0},{"$f":"Q!A33","v":0},{"$f":"Q!A34","v":0},{"$f":"Q!A35","v":0},{"$f":"Q!A36","v":0},{"$f":"Q!A37","v":0},{"$f":"Q!A38","v":0},{"$f":"Q!A39","v":0},{"$f":"Q!A40","v":0},{"$f":"Q!A41","v":0}]
[null,"Compliant?","Compliant?","Compliant?","Compliant?","Compliant?","Compliant?","Compliant?","Compliant?","Compliant?","Compliant?","Compliant?","Compliant?","Compliant?","Compliant?","Compliant?","Compliant?","Compliant?","Compliant?","Compliant?","Compliant?","Compliant?","Compliant?","Compliant?","Compliant?","Compliant?","Compliant?","Compliant?","Compliant?","Compliant?","Compliant?","Compliant?","Compliant?","Compliant?","Compliant?","Compliant?","Compliant?","Compliant?","Compliant?","Compliant?","Compliant?"]
["Total Y",{"$f":"COUNTIF('Apr-Raw'!H:H,\"yes\")","v":5},{"$f":"COUNTIF('Apr-Raw'!J:J,\"yes\")","v":5},{"$f":"COUNTIF('Apr-Raw'!L:L,\"yes\")","v":3},{"$f":"COUNTIF('Apr-Raw'!N:N,\"yes\")","v":5},{"$f":"COUNTIF('Apr-Raw'!P:P,\"yes\")","v":5},{"$f":"COUNTIF('Apr-Raw'!R:R,\"yes\")","v":5},{"$f":"COUNTIF('Apr-Raw'!T:T,\"yes\")","v":3},{"$f":"COUNTIF('Apr-Raw'!V:V,\"yes\")","v":4},{"$f":"COUNTIF('Apr-Raw'!X:X,\"yes\")","v":3},{"$f":"COUNTIF('Apr-Raw'!Z:Z,\"yes\")","v":5},{"$f":"COUNTIF('Apr-Raw'!AB:AB,\"yes\")","v":5},{"$f":"COUNTIF('Apr-Raw'!AD:AD,\"yes\")","v":0},{"$f":"COUNTIF('Apr-Raw'!AF:AF,\"yes\")","v":0},{"$f":"COUNTIF('Apr-Raw'!AH:AH,\"yes\")","v":0},{"$f":"COUNTIF('Apr-Raw'!AJ:AJ,\"yes\")","v":0},{"$f":"COUNTIF('Apr-Raw'!AL:AL,\"yes\")","v":0},{"$f":"COUNTIF('Apr-Raw'!AN:AN,\"yes\")","v":0},{"$f":"COUNTIF('Apr-Raw'!AP:AP,\"yes\")","v":0},{"$f":"COUNTIF('Apr-Raw'!AR:AR,\"yes\")","v":0},{"$f":"COUNTIF('Apr-Raw'!AT:AT,\"yes\")","v":0},{"$f":"COUNTIF('Apr-Raw'!AV:AV,\"yes\")","v":0},{"$f":"COUNTIF('Apr-Raw'!AX:AX,\"yes\")","v":0},{"$f":"COUNTIF('Apr-Raw'!AZ:AZ,\"yes\")","v":0},{"$f":"COUNTIF('Apr-Raw'!BB:BB,\"yes\")","v":0},{"$f":"COUNTIF('Apr-Raw'!BD:BD,\"yes\")","v":0},{"$f":"COUNTIF('Apr-Raw'!BF:BF,\"yes\")","v":0},{"$f":"COUNTIF('Apr-Raw'!BH:BH,\"yes\")","v":0},{"$f":"COUNTIF('Apr-Raw'!BJ:BJ,\"yes\")","v":0},{"$f":"COUNTIF('Apr-Raw'!BL:BL,\"yes\")","v":0},{"$f":"COUNTIF('Apr-Raw'!BN:BN,\"yes\")","v":0},{"$f":"COUNTIF('Apr-Raw'!BP:BP,\"yes\")","v":0},{"$f":"COUNTIF('Apr-Raw'!BR:BR,\"yes\")","v":0},{"$f":"COUNTIF('Apr-Raw'!BT:BT,\"yes\")","v":0},{"$f":"COUNTIF('Apr-Raw'!BV:BV,\"yes\")","v":0},{"$f":"COUNTIF('Apr-Raw'!BX:BX,\"yes\")","v":0},{"$f":"COUNTIF('Apr-Raw'!BZ:BZ,\"yes\")","v":0},{"$f":"COUNTIF('Apr-Raw'!CB:CB,\"yes\")","v":0},{"$f":"COUNTIF('Apr-Raw'!CD:CD,\"yes\")","v":0},{"$f":"COUNTIF('Apr-Raw'!CF:CF,\"yes\")","v":0},{"$f":"COUNTIF('Apr-Raw'!CH:CH,\"yes\")","v":0}]
["Total N",{"$f":"COUNTIF('Apr-Raw'!H:H,\"no\")","v":0},{"$f":"COUNTIF('Apr-Raw'!J:J,\"no\")","v":0},{"$f":"COUNTIF('Apr-Raw'!L:L,\"no\")","v":2},{"$f":"COUNTIF('Apr-Raw'!N:N,\"no\")","v":0},{"$f":"COUNTIF('Apr-Raw'!P:P,\"no\")","v":0},{"$f":"COUNTIF('Apr-Raw'!R:R,\"no\")","v":0},{"$f":"COUNTIF('Apr-Raw'!T:T,\"no\")","v":0},{"$f":"COUNTIF('Apr-Raw'!V:V,\"no\")","v":1},{"$f":"COUNTIF('Apr-Raw'!X:X,\"no\")","v":0},{"$f":"COUNTIF('Apr-Raw'!Z:Z,\"no\")","v":0},{"$f":"COUNTIF('Apr-Raw'!AB:AB,\"no\")","v":0},{"$f":"COUNTIF('Apr-Raw'!AD:AD,\"no\")","v":0},{"$f":"COUNTIF('Apr-Raw'!AF:AF,\"no\")","v":0},{"$f":"COUNTIF('Apr-Raw'!AH:AH,\"no\")","v":0},{"$f":"COUNTIF('Apr-Raw'!AJ:AJ,\"no\")","v":0},{"$f":"COUNTIF('Apr-Raw'!AL:AL,\"no\")","v":0},{"$f":"COUNTIF('Apr-Raw'!AN:AN,\"no\")","v":0},{"$f":"COUNTIF('Apr-Raw'!AP:AP,\"no\")","v":0},{"$f":"COUNTIF('Apr-Raw'!AR:AR,\"no\")","v":0},{"$f":"COUNTIF('Apr-Raw'!AT:AT,\"no\")","v":0},{"$f":"COUNTIF('Apr-Raw'!AV:AV,\"no\")","v":0},{"$f":"COUNTIF('Apr-Raw'!AX:AX,\"no\")","v":0},{"$f":"COUNTIF('Apr-Raw'!AZ:AZ,\"no\")","v":0},{"$f":"COUNTIF('Apr-Raw'!BB:BB,\"no\")","v":0},{"$f":"COUNTIF('Apr-Raw'!BD:BD,\"no\")","v":0},{"$f":"COUNTIF('Apr-Raw'!BF:BF,\"no\")","v":0},{"$f":"COUNTIF('Apr-Raw'!BH:BH,\"no\")","v":0},{"$f":"COUNTIF('Apr-Raw'!BJ:BJ,\"no\")","v":0},{"$f":"COUNTIF('Apr-Raw'!BL:BL,\"no\")","v":0},{"$f":"COUNTIF('Apr-Raw'!BN:BN,\"no\")","v":0},{"$f":"COUNTIF('Apr-Raw'!BP:BP,\"no\")","v":0},{"$f":"COUNTIF('Apr-Raw'!BR:BR,\"no\")","v":0},{"$f":"COUNTIF('Apr-Raw'!BT:BT,\"no\")","v":0},{"$f":"COUNTIF('Apr-Raw'!BV:BV,\"no\")","v":0},{"$f":"COUNTIF('Apr-Raw'!BX:BX,\"no\")","v":0},{"$f":"COUNTIF('Apr-Raw'!BZ:BZ,\"no\")","v":0},{"$f":"COUNTIF('Apr-Raw'!CB:CB,\"no\")","v":0},{"$f":"COUNTIF('Apr-Raw'!CD:CD,\"no\")","v":0},{"$f":"COUNTIF('Apr-Raw'!CF:CF,\"no\")","v":0},{"$f":"COUNTIF('Apr-Raw'!CH:CH,\"no\")","v":0}]
["Total Justified",{"$f":"COUNTIF('Apr-Raw'!H:H,\"Justified\")","v":0},{"$f":"COUNTIF('Apr-Raw'!J:J,\"Justified\")","v":0},{"$f":"COUNTIF('Apr-Raw'!L:L,\"Justified\")","v":0},{"$f":"COUNTIF('Apr-Raw'!N:N,\"Justified\")","v":0},{"$f":"COUNTIF('Apr-Raw'!P:P,\"Justified\")","v":0},{"$f":"COUNTIF('Apr-Raw'!R:R,\"Justified\")","v":0},{"$f":"COUNTIF('Apr-Raw'!T:T,\"Justified\")","v":2},{"$f":"COUNTIF('Apr-Raw'!V:V,\"Justified\")","v":0},{"$f":"COUNTIF('Apr-Raw'!X:X,\"Justified\")","v":2},{"$f":"COUNTIF('Apr-Raw'!Z:Z,\"Justified\")","v":0},{"$f":"COUNTIF('Apr-Raw'!AB:AB,\"Justified\")","v":0},{"$f":"COUNTIF('Apr-Raw'!AD:AD,\"Justified\")","v":0},{"$f":"COUNTIF('Apr-Raw'!AF:AF,\"Justified\")","v":0},{"$f":"COUNTIF('Apr-Raw'!AH:AH,\"Justified\")","v":0},{"$f":"COUNTIF('Apr-Raw'!AJ:AJ,\"Justified\")","v":0},{"$f":"COUNTIF('Apr-Raw'!AL:AL,\"Justified\")","v":0},{"$f":"COUNTIF('Apr-Raw'!AN:AN,\"Justified\")","v":0},{"$f":"COUNTIF('Apr-Raw'!AP:AP,\"Justified\")","v":0},{"$f":"COUNTIF('Apr-Raw'!AR:AR,\"Justified\")","v":0},{"$f":"COUNTIF('Apr-Raw'!AT:AT,\"Justified\")","v":0},{"$f":"COUNTIF('Apr-Raw'!AV:AV,\"Justified\")","v":0},{"$f":"COUNTIF('Apr-Raw'!AX:AX,\"Justified\")","v":0},{"$f":"COUNTIF('Apr-Raw'!AZ:AZ,\"Justified\")","v":0},{"$f":"COUNTIF('Apr-Raw'!BB:BB,\"Justified\")","v":0},{"$f":"COUNTIF('Apr-Raw'!BD:BD,\"Justified\")","v":0},{"$f":"COUNTIF('Apr-Raw'!BF:BF,\"Justified\")","v":0},{"$f":"COUNTIF('Apr-Raw'!BH:BH,\"Justified\")","v":0},{"$f":"COUNTIF('Apr-Raw'!BJ:BJ,\"Justified\")","v":0},{"$f":"COUNTIF('Apr-Raw'!BL:BL,\"Justified\")","v":0},{"$f":"COUNTIF('Apr-Raw'!BN:BN,\"Justified\")","v":0},{"$f":"COUNTIF('Apr-Raw'!BP:BP,\"Justified\")","v":0},{"$f":"COUNTIF('Apr-Raw'!BR:BR,\"Justified\")","v":0},{"$f":"COUNTIF('Apr-Raw'!BT:BT,\"Justified\")","v":0},{"$f":"COUNTIF('Apr-Raw'!BV:BV,\"Justified\")","v":0},{"$f":"COUNTIF('Apr-Raw'!BX:BX,\"Justified\")","v":0},{"$f":"COUNTIF('Apr-Raw'!BZ:BZ,\"Justified\")","v":0},{"$f":"COUNTIF('Apr-Raw'!CB:CB,\"Justified\")","v":0},{"$f":"COUNTIF('Apr-Raw'!CD:CD,\"Justified\")","v":0},{"$f":"COUNTIF('Apr-Raw'!CF:CF,\"Justified\")","v":0},{"$f":"COUNTIF('Apr-Raw'!CH:CH,\"Justified\")","v":0}]
["Total NA",{"$f":"COUNTIF('Apr-Raw'!H:H,\"NA\")","v":0},{"$f":"COUNTIF('Apr-Raw'!J:J,\"NA\")","v":0},{"$f":"COUNTIF('Apr-Raw'!L:L,\"NA\")","v":0},{"$f":"COUNTIF('Apr-Raw'!N:N,\"NA\")","v":0},{"$f":"COUNTIF('Apr-Raw'!P:P,\"NA\")","v":0},{"$f":"COUNTIF('Apr-Raw'!R:R,\"NA\")","v":0},{"$f":"COUNTIF('Apr-Raw'!T:T,\"NA\")","v":0},{"$f":"COUNTIF('Apr-Raw'!V:V,\"NA\")","v":0},{"$f":"COUNTIF('Apr-Raw'!X:X,\"NA\")","v":0},{"$f":"COUNTIF('Apr-Raw'!Z:Z,\"NA\")","v":0},{"$f":"COUNTIF('Apr-Raw'!AB:AB,\"NA\")","v":0},{"$f":"COUNTIF('Apr-Raw'!AD:AD,\"NA\")","v":0},{"$f":"COUNTIF('Apr-Raw'!AF:AF,\"NA\")","v":0},{"$f":"COUNTIF('Apr-Raw'!AH:AH,\"NA\")","v":0},{"$f":"COUNTIF('Apr-Raw'!AJ:AJ,\"NA\")","v":0},{"$f":"COUNTIF('Apr-Raw'!AL:AL,\"NA\")","v":0},{"$f":"COUNTIF('Apr-Raw'!AN:AN,\"NA\")","v":0},{"$f":"COUNTIF('Apr-Raw'!AP:AP,\"NA\")","v":0},{"$f":"COUNTIF('Apr-Raw'!AR:AR,\"NA\")","v":0},{"$f":"COUNTIF('Apr-Raw'!AT:AT,\"NA\")","v":0},{"$f":"COUNTIF('Apr-Raw'!AV:AV,\"NA\")","v":0},{"$f":"COUNTIF('Apr-Raw'!AX:AX,\"NA\")","v":0},{"$f":"COUNTIF('Apr-Raw'!AZ:AZ,\"NA\")","v":0},{"$f":"COUNTIF('Apr-Raw'!BB:BB,\"NA\")","v":0},{"$f":"COUNTIF('Apr-Raw'!BD:BD,\"NA\")","v":0},{"$f":"COUNTIF('Apr-Raw'!BF:BF,\"NA\")","v":0},{"$f":"COUNTIF('Apr-Raw'!BH:BH,\"NA\")","v":0},{"$f":"COUNTIF('Apr-Raw'!BJ:BJ,\"NA\")","v":0},{"$f":"COUNTIF('Apr-Raw'!BL:BL,\"NA\")","v":0},{"$f":"COUNTIF('Apr-Raw'!BN:BN,\"NA\")","v":0},{"$f":"COUNTIF('Apr-Raw'!BP:BP,\"NA\")","v":0},{"$f":"COUNTIF('Apr-Raw'!BR:BR,\"NA\")","v":0},{"$f":"COUNTIF('Apr-Raw'!BT:BT,\"NA\")","v":0},{"$f":"COUNTIF('Apr-Raw'!BV:BV,\"NA\")","v":0},{"$f":"COUNTIF('Apr-Raw'!BX:BX,\"NA\")","v":0},{"$f":"COUNTIF('Apr-Raw'!BZ:BZ,\"NA\")","v":0},{"$f":"COUNTIF('Apr-Raw'!CB:CB,\"NA\")","v":0},{"$f":"COUNTIF('Apr-Raw'!CD:CD,\"NA\")","v":0},{"$f":"COUNTIF('Apr-Raw'!CF:CF,\"NA\")","v":0},{"$f":"COUNTIF('Apr-Raw'!CH:CH,\"NA\")","v":0}]
["Blanks",{"$f":"B8-(SUM(B3:B6))","v":0},{"$f":"C8-(SUM(C3:C6))","v":0},0,0,0,0,0,0,0,0,0,5,5,5,5,5,5,5,5,5,5,5,5,5,5,5,5,5,5,5,5,5,5,5,5,5,5,5,5,5]
["full sample size",{"$f":"COUNTA('Apr-Raw'!A:A)-2","v":5},{"$f":"B8","v":5},5,5,5,5,5,5,5,5,5,5,5,5,5,5,5,5,5,5,5,5,5,5,5,5,5,5,5,5,5,5,5,5,5,5,5,5,5,5]
["True sample size (-NA + blanks)",{"$f":"IF(ISERROR(B8-(B6+B7)),\"\",B8-(B6+B7))","v":5},{"$f":"IF(ISERROR(C8-(C6+C7)),\"\",C8-(C6+C7))","v":5},5,5,5,5,5,5,5,5,5,0,0,0,0,0,0,0,0,0,0,0,0,0,0,0,0,0,0,0,0,0,0,0,0,0,0,0,0,0]
["%Y",{"$f":"IF(ISERROR(B3/B9),\"\",B3/B9)","v":1},{"$f":"IF(ISERROR(C3/C9),\"\",C3/C9)","v":1},0.6,1,1,1,0.6,0.8,0.6,1,1,"","","","","","","","","","","","","","","","","","","","","","","","","","","","",""]
["%N",{"$f":"IF(ISERROR(B4/B9),\"\",B4/B9)","v":0},{"$f":"IF(ISERROR(C4/C9),\"\",C4/C9)","v":0},0.4,0,0,0,0,0.2,0,0,0,"","","","","","","","","","","","","","","","","","","","","","","","","","","","",""]
["%N - Justified",{"$f":"IF(ISERROR(B5/B9),\"\",B5/B9)","v":0},{"$f":"IF(ISERROR(C5/C9),\"\",C5/C9)","v":0},0,0,0,0,0.4,0,0.4,0,0,"","","","","","","","","","","","","","","","","","","","","","","","","","","","",""]

{"sheet":"May","index":9,"n_rows":51,"n_cols":8,"rows_kept":51,"cut":false,"hidden":false,"merged":[]}
["Click here to go to year overview"]
[]
["Date",null,null,"Total by Apt type"]
["Completed by",null,null,"New",{"$f":"COUNTIF('May-Raw'!E3:E103,\"New\")","v":4}]
["Sample group size",{"$f":"COUNTA('May-Raw'!A:A)-2","v":4},null,"Follow up",{"$f":"COUNTIF('May-Raw'!E3:E103,\"Fup\")","v":0},null,null,{"$f":"Year!H5","v":0.95}]
["Overall Result (compliant only)",{"$f":"IF(ISERROR(SUM(D11:D50)/G51),\"\",SUM(D11:D50)/G51)","v":0.88636363636363635},null,"Total by apt Code",null,null,null,{"$f":"Year!H6","v":"80-95%"}]
["Overall Result (compliant & Justified)",{"$f":"IF(ISERROR(SUM(C11:C50)/G51),\"\",SUM(C11:C50)/G51)","v":0.93181818181818177},null,"code goes in here",{"$f":"COUNTIF('May-Raw'!F3:F103,D7)","v":0},null,null,{"$f":"Year!H7","v":0.8}]
["viable qs",{"$f":"G51","v":11}]
[]
["Metric","Target %","Compliant + Justified","Compliant","Justified","Not compliant","Irritating math"]
[{"$f":"IF(ISERROR(Q!A2),\"\",Q!A2)","v":"Was a Room number documented?"},{"$f":"IF(ISERROR(Q!B2),\"\",Q!B2)","v":0},{"$f":"IF(ISERROR(D11+E11),\"\",D11+E11)","v":1},{"$f":"'May-Data'!B10","v":1},{"$f":"'May-Data'!B12","v":0},{"$f":"'May-Data'!B11","v":0},{"$f":"COUNTIF(D11:F11,\">0\")","v":1}]
[{"$f":"IF(ISERROR(Q!A3),\"\",Q!A3)","v":"Were stage A checks completed as appropriate?"},{"$f":"IF(ISERROR(Q!B3),\"\",Q!B3)","v":0},0.75,{"$f":"'May-Data'!C10","v":0.75},{"$f":"'May-Data'!C12","v":0},{"$f":"'May-Data'!C11","v":0.25},2]
[{"$f":"IF(ISERROR(Q!A4),\"\",Q!A4)","v":"Was COSI Part 1 performed?"},{"$f":"IF(ISERROR(Q!B4),\"\",Q!B4)","v":0},0.5,{"$f":"'May-Data'!D10","v":0.5},{"$f":"'May-Data'!D12","v":0},{"$f":"'May-Data'!D11","v":0.5},2]
[{"$f":"IF(ISERROR(Q!A5),\"\",Q!A5)","v":"Was PVP documented?"},{"$f":"IF(ISERROR(Q!B5),\"\",Q!B5)","v":0},1,{"$f":"'May-Data'!E10","v":1},{"$f":"'May-Data'!E12","v":0},{"$f":"'May-Data'!E11","v":0},1]
[{"$f":"IF(ISERROR(Q!A6),\"\",Q!A6)","v":"Was Otoscopy documented?"},{"$f":"IF(ISERROR(Q!B6),\"\",Q!B6)","v":0},1,{"$f":"'May-Data'!F10","v":1},{"$f":"'May-Data'!F12","v":0},{"$f":"'May-Data'!F11","v":0},1]
[{"$f":"IF(ISERROR(Q!A7),\"\",Q!A7)","v":"Document bc at 3 & 4kHz is for programming purposes?"},{"$f":"IF(ISERROR(Q!B7),\"\",Q!B7)","v":0},1,{"$f":"'May-Data'!G10","v":1},{"$f":"'May-Data'!G12","v":0},{"$f":"'May-Data'!G11","v":0},1]
[{"$f":"IF(ISERROR(Q!A8),\"\",Q!A8)","v":"Was Speech testing performed?"},{"$f":"IF(ISERROR(Q!B8),\"\",Q!B8)","v":0},1,{"$f":"'May-Data'!H10","v":0.5},{"$f":"'May-Data'!H12","v":0.5},{"$f":"'May-Data'!H11","v":0},2]
[{"$f":"IF(ISERROR(Q!A9),\"\",Q!A9)","v":"Is it documented whether national criteria were/were not met?"},{"$f":"IF(ISERROR(Q!B9),\"\",Q!B9)","v":0},1,{"$f":"'May-Data'!I10","v":1},{"$f":"'May-Data'!I12","v":0},{"$f":"'May-Data'!I11","v":0},1]
[{"$f":"IF(ISERROR(Q!A10),\"\",Q!A10)","v":"Was a BCHI info pack supplied?"},{"$f":"IF(ISERROR(Q!B10),\"\",Q!B10)","v":0},1,{"$f":"'May-Data'!J10","v":1},{"$f":"'May-Data'!J12","v":0},{"$f":"'May-Data'!J11","v":0},1]
[{"$f":"IF(ISERROR(Q!A11),\"\",Q!A11)","v":"Was the report authorised & issued within target (7 days)?"},{"$f":"IF(ISERROR(Q!B11),\"\",Q!B11)","v":0},1,{"$f":"'May-Data'!K10","v":1},{"$f":"'May-Data'!K12","v":0},{"$f":"'May-Data'!K11","v":0},1]
[{"$f":"IF(ISERROR(Q!A12),\"\",Q!A12)","v":"Was consent documented as appropriate?"},{"$f":"IF(ISERROR(Q!B12),\"\",Q!B12)","v":0},1,{"$f":"'May-Data'!L10","v":1},{"$f":"'May-Data'!L12","v":0},{"$f":"'May-Data'!L11","v":0},1]
[{"$f":"IF(ISERROR(Q!A13),\"\",Q!A13)","v":0},{"$f":"IF(ISERROR(Q!B13),\"\",Q!B13)","v":0},"",{"$f":"'May-Data'!M10","v":""},{"$f":"'May-Data'!M12","v":""},{"$f":"'May-Data'!M11","v":""},0]
[{"$f":"IF(ISERROR(Q!A14),\"\",Q!A14)","v":0},{"$f":"IF(ISERROR(Q!B14),\"\",Q!B14)","v":0},"",{"$f":"'May-Data'!N10","v":""},{"$f":"'May-Data'!N12","v":""},{"$f":"'May-Data'!N11","v":""},0]
[{"$f":"IF(ISERROR(Q!A15),\"\",Q!A15)","v":0},{"$f":"IF(ISERROR(Q!B15),\"\",Q!B15)","v":0},"",{"$f":"'May-Data'!O10","v":""},{"$f":"'May-Data'!O12","v":""},{"$f":"'May-Data'!O11","v":""},0]
[{"$f":"IF(ISERROR(Q!A16),\"\",Q!A16)","v":0},{"$f":"IF(ISERROR(Q!B16),\"\",Q!B16)","v":0},"",{"$f":"'May-Data'!P10","v":""},{"$f":"'May-Data'!P12","v":""},{"$f":"'May-Data'!P11","v":""},0]
[{"$f":"IF(ISERROR(Q!A17),\"\",Q!A17)","v":0},{"$f":"IF(ISERROR(Q!B17),\"\",Q!B17)","v":0},"",{"$f":"'May-Data'!Q10","v":""},{"$f":"'May-Data'!Q12","v":""},{"$f":"'May-Data'!Q11","v":""},0]
[{"$f":"IF(ISERROR(Q!A18),\"\",Q!A18)","v":0},{"$f":"IF(ISERROR(Q!B18),\"\",Q!B18)","v":0},"",{"$f":"'May-Data'!R10","v":""},{"$f":"'May-Data'!R12","v":""},{"$f":"'May-Data'!R11","v":""},0]
[{"$f":"IF(ISERROR(Q!A19),\"\",Q!A19)","v":0},{"$f":"IF(ISERROR(Q!B19),\"\",Q!B19)","v":0},"",{"$f":"'May-Data'!S10","v":""},{"$f":"'May-Data'!S12","v":""},{"$f":"'May-Data'!S11","v":""},0]
[{"$f":"IF(ISERROR(Q!A20),\"\",Q!A20)","v":0},{"$f":"IF(ISERROR(Q!B20),\"\",Q!B20)","v":0},"",{"$f":"'May-Data'!T10","v":""},{"$f":"'May-Data'!T12","v":""},{"$f":"'May-Data'!T11","v":""},0]
[{"$f":"IF(ISERROR(Q!A21),\"\",Q!A21)","v":0},{"$f":"IF(ISERROR(Q!B21),\"\",Q!B21)","v":0},"",{"$f":"'May-Data'!U10","v":""},{"$f":"'May-Data'!U12","v":""},{"$f":"'May-Data'!U11","v":""},0]
[{"$f":"IF(ISERROR(Q!A22),\"\",Q!A22)","v":0},{"$f":"IF(ISERROR(Q!B22),\"\",Q!B22)","v":0},"",{"$f":"'May-Data'!V10","v":""},{"$f":"'May-Data'!V12","v":""},{"$f":"'May-Data'!V11","v":""},0]
[{"$f":"IF(ISERROR(Q!A23),\"\",Q!A23)","v":0},{"$f":"IF(ISERROR(Q!B23),\"\",Q!B23)","v":0},"",{"$f":"'May-Data'!W10","v":""},{"$f":"'May-Data'!W12","v":""},{"$f":"'May-Data'!W11","v":""},0]
[{"$f":"IF(ISERROR(Q!A24),\"\",Q!A24)","v":0},{"$f":"IF(ISERROR(Q!B24),\"\",Q!B24)","v":0},"",{"$f":"'May-Data'!X10","v":""},{"$f":"'May-Data'!X12","v":""},{"$f":"'May-Data'!X11","v":""},0]
[{"$f":"IF(ISERROR(Q!A25),\"\",Q!A25)","v":0},{"$f":"IF(ISERROR(Q!B25),\"\",Q!B25)","v":0},"",{"$f":"'May-Data'!Y10","v":""},{"$f":"'May-Data'!Y12","v":""},{"$f":"'May-Data'!Y11","v":""},0]
[{"$f":"IF(ISERROR(Q!A26),\"\",Q!A26)","v":0},{"$f":"IF(ISERROR(Q!B26),\"\",Q!B26)","v":0},"",{"$f":"'May-Data'!Z10","v":""},{"$f":"'May-Data'!Z12","v":""},{"$f":"'May-Data'!Z11","v":""},0]
[{"$f":"IF(ISERROR(Q!A27),\"\",Q!A27)","v":0},{"$f":"IF(ISERROR(Q!B27),\"\",Q!B27)","v":0},"",{"$f":"'May-Data'!AA10","v":""},{"$f":"'May-Data'!AA12","v":""},{"$f":"'May-Data'!AA11","v":""},0]
[{"$f":"IF(ISERROR(Q!A28),\"\",Q!A28)","v":0},{"$f":"IF(ISERROR(Q!B28),\"\",Q!B28)","v":0},"",{"$f":"'May-Data'!AB10","v":""},{"$f":"'May-Data'!AB12","v":""},{"$f":"'May-Data'!AB11","v":""},0]
[{"$f":"IF(ISERROR(Q!A29),\"\",Q!A29)","v":0},{"$f":"IF(ISERROR(Q!B29),\"\",Q!B29)","v":0},"",{"$f":"'May-Data'!AC10","v":""},{"$f":"'May-Data'!AC12","v":""},{"$f":"'May-Data'!AC11","v":""},0]
[{"$f":"IF(ISERROR(Q!A30),\"\",Q!A30)","v":0},{"$f":"IF(ISERROR(Q!B30),\"\",Q!B30)","v":0},"",{"$f":"'May-Data'!AD10","v":""},{"$f":"'May-Data'!AD12","v":""},{"$f":"'May-Data'!AD11","v":""},0]
[{"$f":"IF(ISERROR(Q!A31),\"\",Q!A31)","v":0},{"$f":"IF(ISERROR(Q!B31),\"\",Q!B31)","v":0},"",{"$f":"'May-Data'!AE10","v":""},{"$f":"'May-Data'!AE12","v":""},{"$f":"'May-Data'!AE11","v":""},0]
[{"$f":"IF(ISERROR(Q!A32),\"\",Q!A32)","v":0},{"$f":"IF(ISERROR(Q!B32),\"\",Q!B32)","v":0},"",{"$f":"'May-Data'!AF10","v":""},{"$f":"'May-Data'!AF12","v":""},{"$f":"'May-Data'!AF11","v":""},0]
[{"$f":"IF(ISERROR(Q!A33),\"\",Q!A33)","v":0},{"$f":"IF(ISERROR(Q!B33),\"\",Q!B33)","v":0},"",{"$f":"'May-Data'!AG10","v":""},{"$f":"'May-Data'!AG12","v":""},{"$f":"'May-Data'!AG11","v":""},0]
[{"$f":"IF(ISERROR(Q!A34),\"\",Q!A34)","v":0},{"$f":"IF(ISERROR(Q!B34),\"\",Q!B34)","v":0},"",{"$f":"'May-Data'!AH10","v":""},{"$f":"'May-Data'!AH12","v":""},{"$f":"'May-Data'!AH11","v":""},0]
[{"$f":"IF(ISERROR(Q!A35),\"\",Q!A35)","v":0},{"$f":"IF(ISERROR(Q!B35),\"\",Q!B35)","v":0},"",{"$f":"'May-Data'!AI10","v":""},{"$f":"'May-Data'!AI12","v":""},{"$f":"'May-Data'!AI11","v":""},0]
[{"$f":"IF(ISERROR(Q!A36),\"\",Q!A36)","v":0},{"$f":"IF(ISERROR(Q!B36),\"\",Q!B36)","v":0},"",{"$f":"'May-Data'!AJ10","v":""},{"$f":"'May-Data'!AJ12","v":""},{"$f":"'May-Data'!AJ11","v":""},0]
[{"$f":"IF(ISERROR(Q!A37),\"\",Q!A37)","v":0},{"$f":"IF(ISERROR(Q!B37),\"\",Q!B37)","v":0},"",{"$f":"'May-Data'!AK10","v":""},{"$f":"'May-Data'!AK12","v":""},{"$f":"'May-Data'!AK11","v":""},0]
[{"$f":"IF(ISERROR(Q!A38),\"\",Q!A38)","v":0},{"$f":"IF(ISERROR(Q!B38),\"\",Q!B38)","v":0},"",{"$f":"'May-Data'!AL10","v":""},{"$f":"'May-Data'!AL12","v":""},{"$f":"'May-Data'!AL11","v":""},0]
[{"$f":"IF(ISERROR(Q!A39),\"\",Q!A39)","v":0},{"$f":"IF(ISERROR(Q!B39),\"\",Q!B39)","v":0},"",{"$f":"'May-Data'!AM10","v":""},{"$f":"'May-Data'!AM12","v":""},{"$f":"'May-Data'!AM11","v":""},0]
[{"$f":"IF(ISERROR(Q!A40),\"\",Q!A40)","v":0},{"$f":"IF(ISERROR(Q!B40),\"\",Q!B40)","v":0},"",{"$f":"'May-Data'!AN10","v":""},{"$f":"'May-Data'!AN12","v":""},{"$f":"'May-Data'!AN11","v":""},0]
[{"$f":"IF(ISERROR(Q!A41),\"\",Q!A41)","v":0},{"$f":"IF(ISERROR(Q!B41),\"\",Q!B41)","v":0},"",{"$f":"'May-Data'!AO10","v":""},{"$f":"'May-Data'!AO12","v":""},{"$f":"'May-Data'!AO11","v":""},0]
[null,null,null,null,null,null,{"$f":"COUNTIF(G11:G50,\">=1\")","v":11}]

{"sheet":"May-Raw","index":10,"n_rows":6,"n_cols":87,"rows_kept":6,"cut":false,"hidden":true,"merged":[[0,85,0,86],[0,63,0,64],[0,65,0,66],[0,67,0,68],[0,69,0,70],[0,71,0,72],[0,73,0,74],[0,75,0,76],[0,77,0,78],[0,79,0,80],[0,81,0,82],[0,83,0,84],[0,61,0,62],[0,39,0,40],[0,41,0,42],[0,43,0,44],[0,45,0,46],[0,47,0,48],[0,49,0,50],[0,51,0,52],[0,53,0,54],[0,55,0,56],[0,57,0,58],[0,59,0,60],[0,37,0,38],[0,15,0,16],[0,17,0,18],[0,19,0,20],[0,21,0,22],[0,23,0,24],[0,25,0,26],[0,27,0,28],[0,29,0,30],[0,31,0,32],[0,33,0,34],[0,35,0,36],[0,13,0,14],[0,0,0,5],[0,6,1,6],[0,7,0,8],[0,9,0,10],[0,11,0,12]]}
["Record details",null,null,null,null,null,"Notes",{"$f":"Q!A2","v":"Was a Room number documented?"},null,{"$f":"Q!A3","v":"Were stage A checks completed as appropriate?"},null,{"$f":"Q!A4","v":"Was COSI Part 1 performed?"},null,{"$f":"Q!A5","v":"Was PVP documented?"},null,{"$f":"Q!A6","v":"Was Otoscopy documented?"},null,{"$f":"Q!A7","v":"Document bc at 3 & 4kHz is for programming purposes?"},null,{"$f":"Q!A8","v":"Was Speech testing performed?"},null,{"$f":"Q!A9","v":"Is it documented whether national criteria were/were not met?"},null,{"$f":"Q!A10","v":"Was a BCHI info pack supplied?"},null,{"$f":"Q!A11","v":"Was the report authorised & issued within target (7 days)?"},null,{"$f":"Q!A12","v":"Was consent documented as appropriate?"},null,{"$f":"Q!A13","v":0},null,{"$f":"Q!A14","v":0},null,{"$f":"Q!A15","v":0},null,{"$f":"Q!A16","v":0},null,{"$f":"Q!A17","v":0},null,{"$f":"Q!A18","v":0},null,{"$f":"Q!A19","v":0},null,{"$f":"Q!A20","v":0},null,{"$f":"Q!A21","v":0},null,{"$f":"Q!A22","v":0},null,{"$f":"Q!A23","v":0},null,{"$f":"Q!A24","v":0},null,{"$f":"Q!A25","v":0},null,{"$f":"Q!A26","v":0},null,{"$f":"Q!A27","v":0},null,{"$f":"Q!A28","v":0},null,{"$f":"Q!A29","v":0},null,{"$f":"Q!A30","v":0},null,{"$f":"Q!A31","v":0},null,{"$f":"Q!A32","v":0},null,{"$f":"Q!A33","v":0},null,{"$f":"Q!A34","v":0},null,{"$f":"Q!A35","v":0},null,{"$f":"Q!A36","v":0},null,{"$f":"Q!A37","v":0},null,{"$f":"Q!A38","v":0},null,{"$f":"Q!A39","v":0},null,{"$f":"Q!A40","v":0},null,{"$f":"Q!A41","v":0}]
["Pt number","Date seen","Clinician 1","clinician 2","New/ F-up","Apt code",null,"Compliant?","Other result","Compliant?","Other result","Compliant?","Other result","Compliant?","Other result","Compliant?","Other result","Compliant?","Other result","Compliant?","Other result","Compliant?","Other result","Compliant?","Other result","Compliant?","Other result","Compliant?","Other result","Compliant?","Other result","Compliant?","Other result","Compliant?","Other result","Compliant?","Other result","Compliant?","Other result","Compliant?","Other result","Compliant?","Other result","Compliant?","Other result","Compliant?","Other result","Compliant?","Other result","Compliant?","Other result","Compliant?","Other result","Compliant?","Other result","Compliant?","Other result","Compliant?","Other result","Compliant?","Other result","Compliant?","Other result","Compliant?","Other result","Compliant?","Other result","Compliant?","Other result","Compliant?","Other result","Compliant?","Other result","Compliant?","Other result","Compliant?","Other result","Compliant?","Other result","Compliant?","Other result","Compliant?","Other result","Compliant?","Other result","Compliant?","Other result"]
["AB0001","2023-05-04","AA",null,"New","BA",null,"Yes",null,"Yes",null,"Yes",null,"Yes",null,"Yes",null,"Yes",null,"Justified","Pt has learning disabilty & unable to perform","Yes",null,"Yes",null,"Yes",null,"Yes"]
["AB0002","2023-05-17","AA",null,"New","BA",null,"Yes",null,"Yes",null,"Yes",null,"Yes",null,"Yes",null,"Yes",null,"Justified","No value due to unilateral loss","Yes",null,"Yes",null,"Yes",null,"Yes"]
["AB0003","2023-05-24","BB",null,"New","BA",null,"Yes",null,"No",null,"No",null,"Yes",null,"Yes",null,"Yes",null,"Yes",null,"Yes",null,"Yes",null,"Yes",null,"Yes"]
["AB0004","2023-05-26","BB",null,"New","BA",null,"Yes",null,"Yes",null,"No",null,"Yes",null,"Yes",null,"Yes",null,"Yes",null,"Yes",null,"Yes",null,"Yes",null,"Yes"]

{"sheet":"May-Data","index":11,"n_rows":12,"n_cols":41,"rows_kept":12,"cut":false,"hidden":true,"merged":[[0,0,1,0]]}
["Results",{"$f":"Q!A2","v":"Was a Room number documented?"},{"$f":"Q!A3","v":"Were stage A checks completed as appropriate?"},{"$f":"Q!A4","v":"Was COSI Part 1 performed?"},{"$f":"Q!A5","v":"Was PVP documented?"},{"$f":"Q!A6","v":"Was Otoscopy documented?"},{"$f":"Q!A7","v":"Document bc at 3 & 4kHz is for programming purposes?"},{"$f":"Q!A8","v":"Was Speech testing performed?"},{"$f":"Q!A9","v":"Is it documented whether national criteria were/were not met?"},{"$f":"Q!A10","v":"Was a BCHI info pack supplied?"},{"$f":"Q!A11","v":"Was the report authorised & issued within target (7 days)?"},{"$f":"Q!A12","v":"Was consent documented as appropriate?"},{"$f":"Q!A13","v":0},{"$f":"Q!A14","v":0},{"$f":"Q!A15","v":0},{"$f":"Q!A16","v":0},{"$f":"Q!A17","v":0},{"$f":"Q!A18","v":0},{"$f":"Q!A19","v":0},{"$f":"Q!A20","v":0},{"$f":"Q!A21","v":0},{"$f":"Q!A22","v":0},{"$f":"Q!A23","v":0},{"$f":"Q!A24","v":0},{"$f":"Q!A25","v":0},{"$f":"Q!A26","v":0},{"$f":"Q!A27","v":0},{"$f":"Q!A28","v":0},{"$f":"Q!A29","v":0},{"$f":"Q!A30","v":0},{"$f":"Q!A31","v":0},{"$f":"Q!A32","v":0},{"$f":"Q!A33","v":0},{"$f":"Q!A34","v":0},{"$f":"Q!A35","v":0},{"$f":"Q!A36","v":0},{"$f":"Q!A37","v":0},{"$f":"Q!A38","v":0},{"$f":"Q!A39","v":0},{"$f":"Q!A40","v":0},{"$f":"Q!A41","v":0}]
[null,"Compliant?","Compliant?","Compliant?","Compliant?","Compliant?","Compliant?","Compliant?","Compliant?","Compliant?","Compliant?","Compliant?","Compliant?","Compliant?","Compliant?","Compliant?","Compliant?","Compliant?","Compliant?","Compliant?","Compliant?","Compliant?","Compliant?","Compliant?","Compliant?","Compliant?","Compliant?","Compliant?","Compliant?","Compliant?","Compliant?","Compliant?","Compliant?","Compliant?","Compliant?","Compliant?","Compliant?","Compliant?","Compliant?","Compliant?","Compliant?"]
["Total Y",{"$f":"COUNTIF('May-Raw'!H:H,\"yes\")","v":4},{"$f":"COUNTIF('May-Raw'!J:J,\"yes\")","v":3},{"$f":"COUNTIF('May-Raw'!L:L,\"yes\")","v":2},{"$f":"COUNTIF('May-Raw'!N:N,\"yes\")","v":4},{"$f":"COUNTIF('May-Raw'!P:P,\"yes\")","v":4},{"$f":"COUNTIF('May-Raw'!R:R,\"yes\")","v":4},{"$f":"COUNTIF('May-Raw'!T:T,\"yes\")","v":2},{"$f":"COUNTIF('May-Raw'!V:V,\"yes\")","v":4},{"$f":"COUNTIF('May-Raw'!X:X,\"yes\")","v":4},{"$f":"COUNTIF('May-Raw'!Z:Z,\"yes\")","v":4},{"$f":"COUNTIF('May-Raw'!AB:AB,\"yes\")","v":4},{"$f":"COUNTIF('May-Raw'!AD:AD,\"yes\")","v":0},{"$f":"COUNTIF('May-Raw'!AF:AF,\"yes\")","v":0},{"$f":"COUNTIF('May-Raw'!AH:AH,\"yes\")","v":0},{"$f":"COUNTIF('May-Raw'!AJ:AJ,\"yes\")","v":0},{"$f":"COUNTIF('May-Raw'!AL:AL,\"yes\")","v":0},{"$f":"COUNTIF('May-Raw'!AN:AN,\"yes\")","v":0},{"$f":"COUNTIF('May-Raw'!AP:AP,\"yes\")","v":0},{"$f":"COUNTIF('May-Raw'!AR:AR,\"yes\")","v":0},{"$f":"COUNTIF('May-Raw'!AT:AT,\"yes\")","v":0},{"$f":"COUNTIF('May-Raw'!AV:AV,\"yes\")","v":0},{"$f":"COUNTIF('May-Raw'!AX:AX,\"yes\")","v":0},{"$f":"COUNTIF('May-Raw'!AZ:AZ,\"yes\")","v":0},{"$f":"COUNTIF('May-Raw'!BB:BB,\"yes\")","v":0},{"$f":"COUNTIF('May-Raw'!BD:BD,\"yes\")","v":0},{"$f":"COUNTIF('May-Raw'!BF:BF,\"yes\")","v":0},{"$f":"COUNTIF('May-Raw'!BH:BH,\"yes\")","v":0},{"$f":"COUNTIF('May-Raw'!BJ:BJ,\"yes\")","v":0},{"$f":"COUNTIF('May-Raw'!BL:BL,\"yes\")","v":0},{"$f":"COUNTIF('May-Raw'!BN:BN,\"yes\")","v":0},{"$f":"COUNTIF('May-Raw'!BP:BP,\"yes\")","v":0},{"$f":"COUNTIF('May-Raw'!BR:BR,\"yes\")","v":0},{"$f":"COUNTIF('May-Raw'!BT:BT,\"yes\")","v":0},{"$f":"COUNTIF('May-Raw'!BV:BV,\"yes\")","v":0},{"$f":"COUNTIF('May-Raw'!BX:BX,\"yes\")","v":0},{"$f":"COUNTIF('May-Raw'!BZ:BZ,\"yes\")","v":0},{"$f":"COUNTIF('May-Raw'!CB:CB,\"yes\")","v":0},{"$f":"COUNTIF('May-Raw'!CD:CD,\"yes\")","v":0},{"$f":"COUNTIF('May-Raw'!CF:CF,\"yes\")","v":0},{"$f":"COUNTIF('May-Raw'!CH:CH,\"yes\")","v":0}]
["Total N",{"$f":"COUNTIF('May-Raw'!H:H,\"no\")","v":0},{"$f":"COUNTIF('May-Raw'!J:J,\"no\")","v":1},{"$f":"COUNTIF('May-Raw'!L:L,\"no\")","v":2},{"$f":"COUNTIF('May-Raw'!N:N,\"no\")","v":0},{"$f":"COUNTIF('May-Raw'!P:P,\"no\")","v":0},{"$f":"COUNTIF('May-Raw'!R:R,\"no\")","v":0},{"$f":"COUNTIF('May-Raw'!T:T,\"no\")","v":0},{"$f":"COUNTIF('May-Raw'!V:V,\"no\")","v":0},{"$f":"COUNTIF('May-Raw'!X:X,\"no\")","v":0},{"$f":"COUNTIF('May-Raw'!Z:Z,\"no\")","v":0},{"$f":"COUNTIF('May-Raw'!AB:AB,\"no\")","v":0},{"$f":"COUNTIF('May-Raw'!AD:AD,\"no\")","v":0},{"$f":"COUNTIF('May-Raw'!AF:AF,\"no\")","v":0},{"$f":"COUNTIF('May-Raw'!AH:AH,\"no\")","v":0},{"$f":"COUNTIF('May-Raw'!AJ:AJ,\"no\")","v":0},{"$f":"COUNTIF('May-Raw'!AL:AL,\"no\")","v":0},{"$f":"COUNTIF('May-Raw'!AN:AN,\"no\")","v":0},{"$f":"COUNTIF('May-Raw'!AP:AP,\"no\")","v":0},{"$f":"COUNTIF('May-Raw'!AR:AR,\"no\")","v":0},{"$f":"COUNTIF('May-Raw'!AT:AT,\"no\")","v":0},{"$f":"COUNTIF('May-Raw'!AV:AV,\"no\")","v":0},{"$f":"COUNTIF('May-Raw'!AX:AX,\"no\")","v":0},{"$f":"COUNTIF('May-Raw'!AZ:AZ,\"no\")","v":0},{"$f":"COUNTIF('May-Raw'!BB:BB,\"no\")","v":0},{"$f":"COUNTIF('May-Raw'!BD:BD,\"no\")","v":0},{"$f":"COUNTIF('May-Raw'!BF:BF,\"no\")","v":0},{"$f":"COUNTIF('May-Raw'!BH:BH,\"no\")","v":0},{"$f":"COUNTIF('May-Raw'!BJ:BJ,\"no\")","v":0},{"$f":"COUNTIF('May-Raw'!BL:BL,\"no\")","v":0},{"$f":"COUNTIF('May-Raw'!BN:BN,\"no\")","v":0},{"$f":"COUNTIF('May-Raw'!BP:BP,\"no\")","v":0},{"$f":"COUNTIF('May-Raw'!BR:BR,\"no\")","v":0},{"$f":"COUNTIF('May-Raw'!BT:BT,\"no\")","v":0},{"$f":"COUNTIF('May-Raw'!BV:BV,\"no\")","v":0},{"$f":"COUNTIF('May-Raw'!BX:BX,\"no\")","v":0},{"$f":"COUNTIF('May-Raw'!BZ:BZ,\"no\")","v":0},{"$f":"COUNTIF('May-Raw'!CB:CB,\"no\")","v":0},{"$f":"COUNTIF('May-Raw'!CD:CD,\"no\")","v":0},{"$f":"COUNTIF('May-Raw'!CF:CF,\"no\")","v":0},{"$f":"COUNTIF('May-Raw'!CH:CH,\"no\")","v":0}]
["Total Justified",{"$f":"COUNTIF('May-Raw'!H:H,\"Justified\")","v":0},{"$f":"COUNTIF('May-Raw'!J:J,\"Justified\")","v":0},{"$f":"COUNTIF('May-Raw'!L:L,\"Justified\")","v":0},{"$f":"COUNTIF('May-Raw'!N:N,\"Justified\")","v":0},{"$f":"COUNTIF('May-Raw'!P:P,\"Justified\")","v":0},{"$f":"COUNTIF('May-Raw'!R:R,\"Justified\")","v":0},{"$f":"COUNTIF('May-Raw'!T:T,\"Justified\")","v":2},{"$f":"COUNTIF('May-Raw'!V:V,\"Justified\")","v":0},{"$f":"COUNTIF('May-Raw'!X:X,\"Justified\")","v":0},{"$f":"COUNTIF('May-Raw'!Z:Z,\"Justified\")","v":0},{"$f":"COUNTIF('May-Raw'!AB:AB,\"Justified\")","v":0},{"$f":"COUNTIF('May-Raw'!AD:AD,\"Justified\")","v":0},{"$f":"COUNTIF('May-Raw'!AF:AF,\"Justified\")","v":0},{"$f":"COUNTIF('May-Raw'!AH:AH,\"Justified\")","v":0},{"$f":"COUNTIF('May-Raw'!AJ:AJ,\"Justified\")","v":0},{"$f":"COUNTIF('May-Raw'!AL:AL,\"Justified\")","v":0},{"$f":"COUNTIF('May-Raw'!AN:AN,\"Justified\")","v":0},{"$f":"COUNTIF('May-Raw'!AP:AP,\"Justified\")","v":0},{"$f":"COUNTIF('May-Raw'!AR:AR,\"Justified\")","v":0},{"$f":"COUNTIF('May-Raw'!AT:AT,\"Justified\")","v":0},{"$f":"COUNTIF('May-Raw'!AV:AV,\"Justified\")","v":0},{"$f":"COUNTIF('May-Raw'!AX:AX,\"Justified\")","v":0},{"$f":"COUNTIF('May-Raw'!AZ:AZ,\"Justified\")","v":0},{"$f":"COUNTIF('May-Raw'!BB:BB,\"Justified\")","v":0},{"$f":"COUNTIF('May-Raw'!BD:BD,\"Justified\")","v":0},{"$f":"COUNTIF('May-Raw'!BF:BF,\"Justified\")","v":0},{"$f":"COUNTIF('May-Raw'!BH:BH,\"Justified\")","v":0},{"$f":"COUNTIF('May-Raw'!BJ:BJ,\"Justified\")","v":0},{"$f":"COUNTIF('May-Raw'!BL:BL,\"Justified\")","v":0},{"$f":"COUNTIF('May-Raw'!BN:BN,\"Justified\")","v":0},{"$f":"COUNTIF('May-Raw'!BP:BP,\"Justified\")","v":0},{"$f":"COUNTIF('May-Raw'!BR:BR,\"Justified\")","v":0},{"$f":"COUNTIF('May-Raw'!BT:BT,\"Justified\")","v":0},{"$f":"COUNTIF('May-Raw'!BV:BV,\"Justified\")","v":0},{"$f":"COUNTIF('May-Raw'!BX:BX,\"Justified\")","v":0},{"$f":"COUNTIF('May-Raw'!BZ:BZ,\"Justified\")","v":0},{"$f":"COUNTIF('May-Raw'!CB:CB,\"Justified\")","v":0},{"$f":"COUNTIF('May-Raw'!CD:CD,\"Justified\")","v":0},{"$f":"COUNTIF('May-Raw'!CF:CF,\"Justified\")","v":0},{"$f":"COUNTIF('May-Raw'!CH:CH,\"Justified\")","v":0}]
["Total NA",{"$f":"COUNTIF('May-Raw'!H:H,\"NA\")","v":0},{"$f":"COUNTIF('May-Raw'!J:J,\"NA\")","v":0},{"$f":"COUNTIF('May-Raw'!L:L,\"NA\")","v":0},{"$f":"COUNTIF('May-Raw'!N:N,\"NA\")","v":0},{"$f":"COUNTIF('May-Raw'!P:P,\"NA\")","v":0},{"$f":"COUNTIF('May-Raw'!R:R,\"NA\")","v":0},{"$f":"COUNTIF('May-Raw'!T:T,\"NA\")","v":0},{"$f":"COUNTIF('May-Raw'!V:V,\"NA\")","v":0},{"$f":"COUNTIF('May-Raw'!X:X,\"NA\")","v":0},{"$f":"COUNTIF('May-Raw'!Z:Z,\"NA\")","v":0},{"$f":"COUNTIF('May-Raw'!AB:AB,\"NA\")","v":0},{"$f":"COUNTIF('May-Raw'!AD:AD,\"NA\")","v":0},{"$f":"COUNTIF('May-Raw'!AF:AF,\"NA\")","v":0},{"$f":"COUNTIF('May-Raw'!AH:AH,\"NA\")","v":0},{"$f":"COUNTIF('May-Raw'!AJ:AJ,\"NA\")","v":0},{"$f":"COUNTIF('May-Raw'!AL:AL,\"NA\")","v":0},{"$f":"COUNTIF('May-Raw'!AN:AN,\"NA\")","v":0},{"$f":"COUNTIF('May-Raw'!AP:AP,\"NA\")","v":0},{"$f":"COUNTIF('May-Raw'!AR:AR,\"NA\")","v":0},{"$f":"COUNTIF('May-Raw'!AT:AT,\"NA\")","v":0},{"$f":"COUNTIF('May-Raw'!AV:AV,\"NA\")","v":0},{"$f":"COUNTIF('May-Raw'!AX:AX,\"NA\")","v":0},{"$f":"COUNTIF('May-Raw'!AZ:AZ,\"NA\")","v":0},{"$f":"COUNTIF('May-Raw'!BB:BB,\"NA\")","v":0},{"$f":"COUNTIF('May-Raw'!BD:BD,\"NA\")","v":0},{"$f":"COUNTIF('May-Raw'!BF:BF,\"NA\")","v":0},{"$f":"COUNTIF('May-Raw'!BH:BH,\"NA\")","v":0},{"$f":"COUNTIF('May-Raw'!BJ:BJ,\"NA\")","v":0},{"$f":"COUNTIF('May-Raw'!BL:BL,\"NA\")","v":0},{"$f":"COUNTIF('May-Raw'!BN:BN,\"NA\")","v":0},{"$f":"COUNTIF('May-Raw'!BP:BP,\"NA\")","v":0},{"$f":"COUNTIF('May-Raw'!BR:BR,\"NA\")","v":0},{"$f":"COUNTIF('May-Raw'!BT:BT,\"NA\")","v":0},{"$f":"COUNTIF('May-Raw'!BV:BV,\"NA\")","v":0},{"$f":"COUNTIF('May-Raw'!BX:BX,\"NA\")","v":0},{"$f":"COUNTIF('May-Raw'!BZ:BZ,\"NA\")","v":0},{"$f":"COUNTIF('May-Raw'!CB:CB,\"NA\")","v":0},{"$f":"COUNTIF('May-Raw'!CD:CD,\"NA\")","v":0},{"$f":"COUNTIF('May-Raw'!CF:CF,\"NA\")","v":0},{"$f":"COUNTIF('May-Raw'!CH:CH,\"NA\")","v":0}]
["Blanks",{"$f":"B8-(SUM(B3:B6))","v":0},{"$f":"C8-(SUM(C3:C6))","v":0},0,0,0,0,0,0,0,0,0,4,4,4,4,4,4,4,4,4,4,4,4,4,4,4,4,4,4,4,4,4,4,4,4,4,4,4,4,4]
["full sample size",{"$f":"COUNTA('May-Raw'!A:A)-2","v":4},{"$f":"B8","v":4},4,4,4,4,4,4,4,4,4,4,4,4,4,4,4,4,4,4,4,4,4,4,4,4,4,4,4,4,4,4,4,4,4,4,4,4,4,4]
["True sample size (-NA + blanks)",{"$f":"IF(ISERROR(B8-(B6+B7)),\"\",B8-(B6+B7))","v":4},{"$f":"IF(ISERROR(C8-(C6+C7)),\"\",C8-(C6+C7))","v":4},4,4,4,4,4,4,4,4,4,0,0,0,0,0,0,0,0,0,0,0,0,0,0,0,0,0,0,0,0,0,0,0,0,0,0,0,0,0]
["%Y",{"$f":"IF(ISERROR(B3/B9),\"\",B3/B9)","v":1},{"$f":"IF(ISERROR(C3/C9),\"\",C3/C9)","v":0.75},0.5,1,1,1,0.5,1,1,1,1,"","","","","","","","","","","","","","","","","","","","","","","","","","","","",""]
["%N",{"$f":"IF(ISERROR(B4/B9),\"\",B4/B9)","v":0},{"$f":"IF(ISERROR(C4/C9),\"\",C4/C9)","v":0.25},0.5,0,0,0,0,0,0,0,0,"","","","","","","","","","","","","","","","","","","","","","","","","","","","",""]
["%N - Justified",{"$f":"IF(ISERROR(B5/B9),\"\",B5/B9)","v":0},{"$f":"IF(ISERROR(C5/C9),\"\",C5/C9)","v":0},0,0,0,0,0.5,0,0,0,0,"","","","","","","","","","","","","","","","","","","","","","","","","","","","",""]

{"sheet":"June","index":12,"n_rows":51,"n_cols":8,"rows_kept":51,"cut":false,"hidden":false,"merged":[]}
["Click here to go to year overview"]
[]
["Date",null,null,"Total by Apt type"]
["Completed by",null,null,"New",{"$f":"COUNTIF('June-Raw'!E3:E103,\"New\")","v":5}]
["Sample group size",{"$f":"COUNTA('June-Raw'!A:A)-2","v":5},null,"Follow up",{"$f":"COUNTIF('June-Raw'!E3:E103,\"Fup\")","v":0},null,null,{"$f":"Year!H5","v":0.95}]
["Overall Result (compliant only)",{"$f":"IF(ISERROR(SUM(D11:D50)/G51),\"\",SUM(D11:D50)/G51)","v":0.94545454545454544},null,"Total by apt Code",null,null,null,{"$f":"Year!H6","v":"80-95%"}]
["Overall Result (compliant & Justified)",{"$f":"IF(ISERROR(SUM(C11:C50)/G51),\"\",SUM(C11:C50)/G51)","v":0.98181818181818192},null,"code goes in here",{"$f":"COUNTIF('June-Raw'!F3:F103,D7)","v":0},null,null,{"$f":"Year!H7","v":0.8}]
["viable qs",{"$f":"G51","v":11}]
[]
["Metric","Target %","Compliant + Justified","Compliant","Justified","Not compliant","Irritating math"]
[{"$f":"IF(ISERROR(Q!A2),\"\",Q!A2)","v":"Was a Room number documented?"},{"$f":"IF(ISERROR(Q!B2),\"\",Q!B2)","v":0},{"$f":"IF(ISERROR(D11+E11),\"\",D11+E11)","v":1},{"$f":"'June-Data'!B10","v":1},{"$f":"'June-Data'!B12","v":0},{"$f":"'June-Data'!B11","v":0},{"$f":"COUNTIF(D11:F11,\">0\")","v":1}]
[{"$f":"IF(ISERROR(Q!A3),\"\",Q!A3)","v":"Were stage A checks completed as appropriate?"},{"$f":"IF(ISERROR(Q!B3),\"\",Q!B3)","v":0},1,{"$f":"'June-Data'!C10","v":1},{"$f":"'June-Data'!C12","v":0},{"$f":"'June-Data'!C11","v":0},1]
[{"$f":"IF(ISERROR(Q!A4),\"\",Q!A4)","v":"Was COSI Part 1 performed?"},{"$f":"IF(ISERROR(Q!B4),\"\",Q!B4)","v":0},0.8,{"$f":"'June-Data'!D10","v":0.8},{"$f":"'June-Data'!D12","v":0},{"$f":"'June-Data'!D11","v":0.2},2]
[{"$f":"IF(ISERROR(Q!A5),\"\",Q!A5)","v":"Was PVP documented?"},{"$f":"IF(ISERROR(Q!B5),\"\",Q!B5)","v":0},1,{"$f":"'June-Data'!E10","v":1},{"$f":"'June-Data'!E12","v":0},{"$f":"'June-Data'!E11","v":0},1]
[{"$f":"IF(ISERROR(Q!A6),\"\",Q!A6)","v":"Was Otoscopy documented?"},{"$f":"IF(ISERROR(Q!B6),\"\",Q!B6)","v":0},1,{"$f":"'June-Data'!F10","v":1},{"$f":"'June-Data'!F12","v":0},{"$f":"'June-Data'!F11","v":0},1]
[{"$f":"IF(ISERROR(Q!A7),\"\",Q!A7)","v":"Document bc at 3 & 4kHz is for programming purposes?"},{"$f":"IF(ISERROR(Q!B7),\"\",Q!B7)","v":0},1,{"$f":"'June-Data'!G10","v":1},{"$f":"'June-Data'!G12","v":0},{"$f":"'June-Data'!G11","v":0},1]
[{"$f":"IF(ISERROR(Q!A8),\"\",Q!A8)","v":"Was Speech testing performed?"},{"$f":"IF(ISERROR(Q!B8),\"\",Q!B8)","v":0},1,{"$f":"'June-Data'!H10","v":0.8},{"$f":"'June-Data'!H12","v":0.2},{"$f":"'June-Data'!H11","v":0},2]
[{"$f":"IF(ISERROR(Q!A9),\"\",Q!A9)","v":"Is it documented whether national criteria were/were not met?"},{"$f":"IF(ISERROR(Q!B9),\"\",Q!B9)","v":0},1,{"$f":"'June-Data'!I10","v":1},{"$f":"'June-Data'!I12","v":0},{"$f":"'June-Data'!I11","v":0},1]
[{"$f":"IF(ISERROR(Q!A10),\"\",Q!A10)","v":"Was a BCHI info pack supplied?"},{"$f":"IF(ISERROR(Q!B10),\"\",Q!B10)","v":0},1,{"$f":"'June-Data'!J10","v":0.8},{"$f":"'June-Data'!J12","v":0.2},{"$f":"'June-Data'!J11","v":0},2]
[{"$f":"IF(ISERROR(Q!A11),\"\",Q!A11)","v":"Was the report authorised & issued within target (7 days)?"},{"$f":"IF(ISERROR(Q!B11),\"\",Q!B11)","v":0},1,{"$f":"'June-Data'!K10","v":1},{"$f":"'June-Data'!K12","v":0},{"$f":"'June-Data'!K11","v":0},1]
[{"$f":"IF(ISERROR(Q!A12),\"\",Q!A12)","v":"Was consent documented as appropriate?"},{"$f":"IF(ISERROR(Q!B12),\"\",Q!B12)","v":0},1,{"$f":"'June-Data'!L10","v":1},{"$f":"'June-Data'!L12","v":0},{"$f":"'June-Data'!L11","v":0},1]
[{"$f":"IF(ISERROR(Q!A13),\"\",Q!A13)","v":0},{"$f":"IF(ISERROR(Q!B13),\"\",Q!B13)","v":0},"",{"$f":"'June-Data'!M10","v":""},{"$f":"'June-Data'!M12","v":""},{"$f":"'June-Data'!M11","v":""},0]
[{"$f":"IF(ISERROR(Q!A14),\"\",Q!A14)","v":0},{"$f":"IF(ISERROR(Q!B14),\"\",Q!B14)","v":0},"",{"$f":"'June-Data'!N10","v":""},{"$f":"'June-Data'!N12","v":""},{"$f":"'June-Data'!N11","v":""},0]
[{"$f":"IF(ISERROR(Q!A15),\"\",Q!A15)","v":0},{"$f":"IF(ISERROR(Q!B15),\"\",Q!B15)","v":0},"",{"$f":"'June-Data'!O10","v":""},{"$f":"'June-Data'!O12","v":""},{"$f":"'June-Data'!O11","v":""},0]
[{"$f":"IF(ISERROR(Q!A16),\"\",Q!A16)","v":0},{"$f":"IF(ISERROR(Q!B16),\"\",Q!B16)","v":0},"",{"$f":"'June-Data'!P10","v":""},{"$f":"'June-Data'!P12","v":""},{"$f":"'June-Data'!P11","v":""},0]
[{"$f":"IF(ISERROR(Q!A17),\"\",Q!A17)","v":0},{"$f":"IF(ISERROR(Q!B17),\"\",Q!B17)","v":0},"",{"$f":"'June-Data'!Q10","v":""},{"$f":"'June-Data'!Q12","v":""},{"$f":"'June-Data'!Q11","v":""},0]
[{"$f":"IF(ISERROR(Q!A18),\"\",Q!A18)","v":0},{"$f":"IF(ISERROR(Q!B18),\"\",Q!B18)","v":0},"",{"$f":"'June-Data'!R10","v":""},{"$f":"'June-Data'!R12","v":""},{"$f":"'June-Data'!R11","v":""},0]
[{"$f":"IF(ISERROR(Q!A19),\"\",Q!A19)","v":0},{"$f":"IF(ISERROR(Q!B19),\"\",Q!B19)","v":0},"",{"$f":"'June-Data'!S10","v":""},{"$f":"'June-Data'!S12","v":""},{"$f":"'June-Data'!S11","v":""},0]
[{"$f":"IF(ISERROR(Q!A20),\"\",Q!A20)","v":0},{"$f":"IF(ISERROR(Q!B20),\"\",Q!B20)","v":0},"",{"$f":"'June-Data'!T10","v":""},{"$f":"'June-Data'!T12","v":""},{"$f":"'June-Data'!T11","v":""},0]
[{"$f":"IF(ISERROR(Q!A21),\"\",Q!A21)","v":0},{"$f":"IF(ISERROR(Q!B21),\"\",Q!B21)","v":0},"",{"$f":"'June-Data'!U10","v":""},{"$f":"'June-Data'!U12","v":""},{"$f":"'June-Data'!U11","v":""},0]
[{"$f":"IF(ISERROR(Q!A22),\"\",Q!A22)","v":0},{"$f":"IF(ISERROR(Q!B22),\"\",Q!B22)","v":0},"",{"$f":"'June-Data'!V10","v":""},{"$f":"'June-Data'!V12","v":""},{"$f":"'June-Data'!V11","v":""},0]
[{"$f":"IF(ISERROR(Q!A23),\"\",Q!A23)","v":0},{"$f":"IF(ISERROR(Q!B23),\"\",Q!B23)","v":0},"",{"$f":"'June-Data'!W10","v":""},{"$f":"'June-Data'!W12","v":""},{"$f":"'June-Data'!W11","v":""},0]
[{"$f":"IF(ISERROR(Q!A24),\"\",Q!A24)","v":0},{"$f":"IF(ISERROR(Q!B24),\"\",Q!B24)","v":0},"",{"$f":"'June-Data'!X10","v":""},{"$f":"'June-Data'!X12","v":""},{"$f":"'June-Data'!X11","v":""},0]
[{"$f":"IF(ISERROR(Q!A25),\"\",Q!A25)","v":0},{"$f":"IF(ISERROR(Q!B25),\"\",Q!B25)","v":0},"",{"$f":"'June-Data'!Y10","v":""},{"$f":"'June-Data'!Y12","v":""},{"$f":"'June-Data'!Y11","v":""},0]
[{"$f":"IF(ISERROR(Q!A26),\"\",Q!A26)","v":0},{"$f":"IF(ISERROR(Q!B26),\"\",Q!B26)","v":0},"",{"$f":"'June-Data'!Z10","v":""},{"$f":"'June-Data'!Z12","v":""},{"$f":"'June-Data'!Z11","v":""},0]
[{"$f":"IF(ISERROR(Q!A27),\"\",Q!A27)","v":0},{"$f":"IF(ISERROR(Q!B27),\"\",Q!B27)","v":0},"",{"$f":"'June-Data'!AA10","v":""},{"$f":"'June-Data'!AA12","v":""},{"$f":"'June-Data'!AA11","v":""},0]
[{"$f":"IF(ISERROR(Q!A28),\"\",Q!A28)","v":0},{"$f":"IF(ISERROR(Q!B28),\"\",Q!B28)","v":0},"",{"$f":"'June-Data'!AB10","v":""},{"$f":"'June-Data'!AB12","v":""},{"$f":"'June-Data'!AB11","v":""},0]
[{"$f":"IF(ISERROR(Q!A29),\"\",Q!A29)","v":0},{"$f":"IF(ISERROR(Q!B29),\"\",Q!B29)","v":0},"",{"$f":"'June-Data'!AC10","v":""},{"$f":"'June-Data'!AC12","v":""},{"$f":"'June-Data'!AC11","v":""},0]
[{"$f":"IF(ISERROR(Q!A30),\"\",Q!A30)","v":0},{"$f":"IF(ISERROR(Q!B30),\"\",Q!B30)","v":0},"",{"$f":"'June-Data'!AD10","v":""},{"$f":"'June-Data'!AD12","v":""},{"$f":"'June-Data'!AD11","v":""},0]
[{"$f":"IF(ISERROR(Q!A31),\"\",Q!A31)","v":0},{"$f":"IF(ISERROR(Q!B31),\"\",Q!B31)","v":0},"",{"$f":"'June-Data'!AE10","v":""},{"$f":"'June-Data'!AE12","v":""},{"$f":"'June-Data'!AE11","v":""},0]
[{"$f":"IF(ISERROR(Q!A32),\"\",Q!A32)","v":0},{"$f":"IF(ISERROR(Q!B32),\"\",Q!B32)","v":0},"",{"$f":"'June-Data'!AF10","v":""},{"$f":"'June-Data'!AF12","v":""},{"$f":"'June-Data'!AF11","v":""},0]
[{"$f":"IF(ISERROR(Q!A33),\"\",Q!A33)","v":0},{"$f":"IF(ISERROR(Q!B33),\"\",Q!B33)","v":0},"",{"$f":"'June-Data'!AG10","v":""},{"$f":"'June-Data'!AG12","v":""},{"$f":"'June-Data'!AG11","v":""},0]
[{"$f":"IF(ISERROR(Q!A34),\"\",Q!A34)","v":0},{"$f":"IF(ISERROR(Q!B34),\"\",Q!B34)","v":0},"",{"$f":"'June-Data'!AH10","v":""},{"$f":"'June-Data'!AH12","v":""},{"$f":"'June-Data'!AH11","v":""},0]
[{"$f":"IF(ISERROR(Q!A35),\"\",Q!A35)","v":0},{"$f":"IF(ISERROR(Q!B35),\"\",Q!B35)","v":0},"",{"$f":"'June-Data'!AI10","v":""},{"$f":"'June-Data'!AI12","v":""},{"$f":"'June-Data'!AI11","v":""},0]
[{"$f":"IF(ISERROR(Q!A36),\"\",Q!A36)","v":0},{"$f":"IF(ISERROR(Q!B36),\"\",Q!B36)","v":0},"",{"$f":"'June-Data'!AJ10","v":""},{"$f":"'June-Data'!AJ12","v":""},{"$f":"'June-Data'!AJ11","v":""},0]
[{"$f":"IF(ISERROR(Q!A37),\"\",Q!A37)","v":0},{"$f":"IF(ISERROR(Q!B37),\"\",Q!B37)","v":0},"",{"$f":"'June-Data'!AK10","v":""},{"$f":"'June-Data'!AK12","v":""},{"$f":"'June-Data'!AK11","v":""},0]
[{"$f":"IF(ISERROR(Q!A38),\"\",Q!A38)","v":0},{"$f":"IF(ISERROR(Q!B38),\"\",Q!B38)","v":0},"",{"$f":"'June-Data'!AL10","v":""},{"$f":"'June-Data'!AL12","v":""},{"$f":"'June-Data'!AL11","v":""},0]
[{"$f":"IF(ISERROR(Q!A39),\"\",Q!A39)","v":0},{"$f":"IF(ISERROR(Q!B39),\"\",Q!B39)","v":0},"",{"$f":"'June-Data'!AM10","v":""},{"$f":"'June-Data'!AM12","v":""},{"$f":"'June-Data'!AM11","v":""},0]
[{"$f":"IF(ISERROR(Q!A40),\"\",Q!A40)","v":0},{"$f":"IF(ISERROR(Q!B40),\"\",Q!B40)","v":0},"",{"$f":"'June-Data'!AN10","v":""},{"$f":"'June-Data'!AN12","v":""},{"$f":"'June-Data'!AN11","v":""},0]
[{"$f":"IF(ISERROR(Q!A41),\"\",Q!A41)","v":0},{"$f":"IF(ISERROR(Q!B41),\"\",Q!B41)","v":0},"",{"$f":"'June-Data'!AO10","v":""},{"$f":"'June-Data'!AO12","v":""},{"$f":"'June-Data'!AO11","v":""},0]
[null,null,null,null,null,null,{"$f":"COUNTIF(G11:G50,\">=1\")","v":11}]

{"sheet":"June-Raw","index":13,"n_rows":7,"n_cols":87,"rows_kept":7,"cut":false,"hidden":true,"merged":[[0,85,0,86],[0,63,0,64],[0,65,0,66],[0,67,0,68],[0,69,0,70],[0,71,0,72],[0,73,0,74],[0,75,0,76],[0,77,0,78],[0,79,0,80],[0,81,0,82],[0,83,0,84],[0,61,0,62],[0,39,0,40],[0,41,0,42],[0,43,0,44],[0,45,0,46],[0,47,0,48],[0,49,0,50],[0,51,0,52],[0,53,0,54],[0,55,0,56],[0,57,0,58],[0,59,0,60],[0,37,0,38],[0,15,0,16],[0,17,0,18],[0,19,0,20],[0,21,0,22],[0,23,0,24],[0,25,0,26],[0,27,0,28],[0,29,0,30],[0,31,0,32],[0,33,0,34],[0,35,0,36],[0,13,0,14],[0,0,0,5],[0,6,1,6],[0,7,0,8],[0,9,0,10],[0,11,0,12]]}
["Record details",null,null,null,null,null,"Notes",{"$f":"Q!A2","v":"Was a Room number documented?"},null,{"$f":"Q!A3","v":"Were stage A checks completed as appropriate?"},null,{"$f":"Q!A4","v":"Was COSI Part 1 performed?"},null,{"$f":"Q!A5","v":"Was PVP documented?"},null,{"$f":"Q!A6","v":"Was Otoscopy documented?"},null,{"$f":"Q!A7","v":"Document bc at 3 & 4kHz is for programming purposes?"},null,{"$f":"Q!A8","v":"Was Speech testing performed?"},null,{"$f":"Q!A9","v":"Is it documented whether national criteria were/were not met?"},null,{"$f":"Q!A10","v":"Was a BCHI info pack supplied?"},null,{"$f":"Q!A11","v":"Was the report authorised & issued within target (7 days)?"},null,{"$f":"Q!A12","v":"Was consent documented as appropriate?"},null,{"$f":"Q!A13","v":0},null,{"$f":"Q!A14","v":0},null,{"$f":"Q!A15","v":0},null,{"$f":"Q!A16","v":0},null,{"$f":"Q!A17","v":0},null,{"$f":"Q!A18","v":0},null,{"$f":"Q!A19","v":0},null,{"$f":"Q!A20","v":0},null,{"$f":"Q!A21","v":0},null,{"$f":"Q!A22","v":0},null,{"$f":"Q!A23","v":0},null,{"$f":"Q!A24","v":0},null,{"$f":"Q!A25","v":0},null,{"$f":"Q!A26","v":0},null,{"$f":"Q!A27","v":0},null,{"$f":"Q!A28","v":0},null,{"$f":"Q!A29","v":0},null,{"$f":"Q!A30","v":0},null,{"$f":"Q!A31","v":0},null,{"$f":"Q!A32","v":0},null,{"$f":"Q!A33","v":0},null,{"$f":"Q!A34","v":0},null,{"$f":"Q!A35","v":0},null,{"$f":"Q!A36","v":0},null,{"$f":"Q!A37","v":0},null,{"$f":"Q!A38","v":0},null,{"$f":"Q!A39","v":0},null,{"$f":"Q!A40","v":0},null,{"$f":"Q!A41","v":0}]
["Pt number","Date seen","Clinician 1","clinician 2","New/ F-up","Apt code",null,"Compliant?","Other result","Compliant?","Other result","Compliant?","Other result","Compliant?","Other result","Compliant?","Other result","Compliant?","Other result","Compliant?","Other result","Compliant?","Other result","Compliant?","Other result","Compliant?","Other result","Compliant?","Other result","Compliant?","Other result","Compliant?","Other result","Compliant?","Other result","Compliant?","Other result","Compliant?","Other result","Compliant?","Other result","Compliant?","Other result","Compliant?","Other result","Compliant?","Other result","Compliant?","Other result","Compliant?","Other result","Compliant?","Other result","Compliant?","Other result","Compliant?","Other result","Compliant?","Other result","Compliant?","Other result","Compliant?","Other result","Compliant?","Other result","Compliant?","Other result","Compliant?","Other result","Compliant?","Other result","Compliant?","Other result","Compliant?","Other result","Compliant?","Other result","Compliant?","Other result","Compliant?","Other result","Compliant?","Other result","Compliant?","Other result","Compliant?","Other result"]
["AB0001","2023-06-06","AA",null,"New","BA",null,"Yes",null,"Yes",null,"Yes",null,"Yes",null,"Yes",null,"Yes",null,"Justified","English not first language","Yes",null,"Yes",null,"Yes",null,"Yes"]
["AB0002","2023-06-17","AA",null,"New","BA",null,"Yes",null,"Yes",null,"No",null,"Yes",null,"Yes",null,"Yes",null,"Yes",null,"Yes",null,"Yes",null,"Yes",null,"Yes"]
["AB0003","2023-06-24","BB",null,"New","BA",null,"Yes",null,"Yes",null,"Yes",null,"Yes",null,"Yes",null,"Yes",null,"Yes",null,"Yes",null,"Yes",null,"Yes",null,"Yes"]
["AB0004","2023-06-26","BB",null,"New","BA",null,"Yes",null,"Yes",null,"Yes",null,"Yes",null,"Yes",null,"Yes",null,"Yes",null,"Yes",null,"Yes",null,"Yes",null,"Yes"]
["AB0005","2023-06-28","CC",null,"New","BA",null,"Yes",null,"Yes",null,"Yes",null,"Yes",null,"Yes",null,"Yes",null,"Yes",null,"Yes",null,"Justified","Not in criteria for BCHI","Yes",null,"Yes"]

{"sheet":"June-Data","index":14,"n_rows":12,"n_cols":41,"rows_kept":12,"cut":false,"hidden":true,"merged":[[0,0,1,0]]}
["Results",{"$f":"Q!A2","v":"Was a Room number documented?"},{"$f":"Q!A3","v":"Were stage A checks completed as appropriate?"},{"$f":"Q!A4","v":"Was COSI Part 1 performed?"},{"$f":"Q!A5","v":"Was PVP documented?"},{"$f":"Q!A6","v":"Was Otoscopy documented?"},{"$f":"Q!A7","v":"Document bc at 3 & 4kHz is for programming purposes?"},{"$f":"Q!A8","v":"Was Speech testing performed?"},{"$f":"Q!A9","v":"Is it documented whether national criteria were/were not met?"},{"$f":"Q!A10","v":"Was a BCHI info pack supplied?"},{"$f":"Q!A11","v":"Was the report authorised & issued within target (7 days)?"},{"$f":"Q!A12","v":"Was consent documented as appropriate?"},{"$f":"Q!A13","v":0},{"$f":"Q!A14","v":0},{"$f":"Q!A15","v":0},{"$f":"Q!A16","v":0},{"$f":"Q!A17","v":0},{"$f":"Q!A18","v":0},{"$f":"Q!A19","v":0},{"$f":"Q!A20","v":0},{"$f":"Q!A21","v":0},{"$f":"Q!A22","v":0},{"$f":"Q!A23","v":0},{"$f":"Q!A24","v":0},{"$f":"Q!A25","v":0},{"$f":"Q!A26","v":0},{"$f":"Q!A27","v":0},{"$f":"Q!A28","v":0},{"$f":"Q!A29","v":0},{"$f":"Q!A30","v":0},{"$f":"Q!A31","v":0},{"$f":"Q!A32","v":0},{"$f":"Q!A33","v":0},{"$f":"Q!A34","v":0},{"$f":"Q!A35","v":0},{"$f":"Q!A36","v":0},{"$f":"Q!A37","v":0},{"$f":"Q!A38","v":0},{"$f":"Q!A39","v":0},{"$f":"Q!A40","v":0},{"$f":"Q!A41","v":0}]
[null,"Compliant?","Compliant?","Compliant?","Compliant?","Compliant?","Compliant?","Compliant?","Compliant?","Compliant?","Compliant?","Compliant?","Compliant?","Compliant?","Compliant?","Compliant?","Compliant?","Compliant?","Compliant?","Compliant?","Compliant?","Compliant?","Compliant?","Compliant?","Compliant?","Compliant?","Compliant?","Compliant?","Compliant?","Compliant?","Compliant?","Compliant?","Compliant?","Compliant?","Compliant?","Compliant?","Compliant?","Compliant?","Compliant?","Compliant?","Compliant?"]
["Total Y",{"$f":"COUNTIF('June-Raw'!H:H,\"yes\")","v":5},{"$f":"COUNTIF('June-Raw'!J:J,\"yes\")","v":5},{"$f":"COUNTIF('June-Raw'!L:L,\"yes\")","v":4},{"$f":"COUNTIF('June-Raw'!N:N,\"yes\")","v":5},{"$f":"COUNTIF('June-Raw'!P:P,\"yes\")","v":5},{"$f":"COUNTIF('June-Raw'!R:R,\"yes\")","v":5},{"$f":"COUNTIF('June-Raw'!T:T,\"yes\")","v":4},{"$f":"COUNTIF('June-Raw'!V:V,\"yes\")","v":5},{"$f":"COUNTIF('June-Raw'!X:X,\"yes\")","v":4},{"$f":"COUNTIF('June-Raw'!Z:Z,\"yes\")","v":5},{"$f":"COUNTIF('June-Raw'!AB:AB,\"yes\")","v":5},{"$f":"COUNTIF('June-Raw'!AD:AD,\"yes\")","v":0},{"$f":"COUNTIF('June-Raw'!AF:AF,\"yes\")","v":0},{"$f":"COUNTIF('June-Raw'!AH:AH,\"yes\")","v":0},{"$f":"COUNTIF('June-Raw'!AJ:AJ,\"yes\")","v":0},{"$f":"COUNTIF('June-Raw'!AL:AL,\"yes\")","v":0},{"$f":"COUNTIF('June-Raw'!AN:AN,\"yes\")","v":0},{"$f":"COUNTIF('June-Raw'!AP:AP,\"yes\")","v":0},{"$f":"COUNTIF('June-Raw'!AR:AR,\"yes\")","v":0},{"$f":"COUNTIF('June-Raw'!AT:AT,\"yes\")","v":0},{"$f":"COUNTIF('June-Raw'!AV:AV,\"yes\")","v":0},{"$f":"COUNTIF('June-Raw'!AX:AX,\"yes\")","v":0},{"$f":"COUNTIF('June-Raw'!AZ:AZ,\"yes\")","v":0},{"$f":"COUNTIF('June-Raw'!BB:BB,\"yes\")","v":0},{"$f":"COUNTIF('June-Raw'!BD:BD,\"yes\")","v":0},{"$f":"COUNTIF('June-Raw'!BF:BF,\"yes\")","v":0},{"$f":"COUNTIF('June-Raw'!BH:BH,\"yes\")","v":0},{"$f":"COUNTIF('June-Raw'!BJ:BJ,\"yes\")","v":0},{"$f":"COUNTIF('June-Raw'!BL:BL,\"yes\")","v":0},{"$f":"COUNTIF('June-Raw'!BN:BN,\"yes\")","v":0},{"$f":"COUNTIF('June-Raw'!BP:BP,\"yes\")","v":0},{"$f":"COUNTIF('June-Raw'!BR:BR,\"yes\")","v":0},{"$f":"COUNTIF('June-Raw'!BT:BT,\"yes\")","v":0},{"$f":"COUNTIF('June-Raw'!BV:BV,\"yes\")","v":0},{"$f":"COUNTIF('June-Raw'!BX:BX,\"yes\")","v":0},{"$f":"COUNTIF('June-Raw'!BZ:BZ,\"yes\")","v":0},{"$f":"COUNTIF('June-Raw'!CB:CB,\"yes\")","v":0},{"$f":"COUNTIF('June-Raw'!CD:CD,\"yes\")","v":0},{"$f":"COUNTIF('June-Raw'!CF:CF,\"yes\")","v":0},{"$f":"COUNTIF('June-Raw'!CH:CH,\"yes\")","v":0}]
["Total N",{"$f":"COUNTIF('June-Raw'!H:H,\"no\")","v":0},{"$f":"COUNTIF('June-Raw'!J:J,\"no\")","v":0},{"$f":"COUNTIF('June-Raw'!L:L,\"no\")","v":1},{"$f":"COUNTIF('June-Raw'!N:N,\"no\")","v":0},{"$f":"COUNTIF('June-Raw'!P:P,\"no\")","v":0},{"$f":"COUNTIF('June-Raw'!R:R,\"no\")","v":0},{"$f":"COUNTIF('June-Raw'!T:T,\"no\")","v":0},{"$f":"COUNTIF('June-Raw'!V:V,\"no\")","v":0},{"$f":"COUNTIF('June-Raw'!X:X,\"no\")","v":0},{"$f":"COUNTIF('June-Raw'!Z:Z,\"no\")","v":0},{"$f":"COUNTIF('June-Raw'!AB:AB,\"no\")","v":0},{"$f":"COUNTIF('June-Raw'!AD:AD,\"no\")","v":0},{"$f":"COUNTIF('June-Raw'!AF:AF,\"no\")","v":0},{"$f":"COUNTIF('June-Raw'!AH:AH,\"no\")","v":0},{"$f":"COUNTIF('June-Raw'!AJ:AJ,\"no\")","v":0},{"$f":"COUNTIF('June-Raw'!AL:AL,\"no\")","v":0},{"$f":"COUNTIF('June-Raw'!AN:AN,\"no\")","v":0},{"$f":"COUNTIF('June-Raw'!AP:AP,\"no\")","v":0},{"$f":"COUNTIF('June-Raw'!AR:AR,\"no\")","v":0},{"$f":"COUNTIF('June-Raw'!AT:AT,\"no\")","v":0},{"$f":"COUNTIF('June-Raw'!AV:AV,\"no\")","v":0},{"$f":"COUNTIF('June-Raw'!AX:AX,\"no\")","v":0},{"$f":"COUNTIF('June-Raw'!AZ:AZ,\"no\")","v":0},{"$f":"COUNTIF('June-Raw'!BB:BB,\"no\")","v":0},{"$f":"COUNTIF('June-Raw'!BD:BD,\"no\")","v":0},{"$f":"COUNTIF('June-Raw'!BF:BF,\"no\")","v":0},{"$f":"COUNTIF('June-Raw'!BH:BH,\"no\")","v":0},{"$f":"COUNTIF('June-Raw'!BJ:BJ,\"no\")","v":0},{"$f":"COUNTIF('June-Raw'!BL:BL,\"no\")","v":0},{"$f":"COUNTIF('June-Raw'!BN:BN,\"no\")","v":0},{"$f":"COUNTIF('June-Raw'!BP:BP,\"no\")","v":0},{"$f":"COUNTIF('June-Raw'!BR:BR,\"no\")","v":0},{"$f":"COUNTIF('June-Raw'!BT:BT,\"no\")","v":0},{"$f":"COUNTIF('June-Raw'!BV:BV,\"no\")","v":0},{"$f":"COUNTIF('June-Raw'!BX:BX,\"no\")","v":0},{"$f":"COUNTIF('June-Raw'!BZ:BZ,\"no\")","v":0},{"$f":"COUNTIF('June-Raw'!CB:CB,\"no\")","v":0},{"$f":"COUNTIF('June-Raw'!CD:CD,\"no\")","v":0},{"$f":"COUNTIF('June-Raw'!CF:CF,\"no\")","v":0},{"$f":"COUNTIF('June-Raw'!CH:CH,\"no\")","v":0}]
["Total Justified",{"$f":"COUNTIF('June-Raw'!H:H,\"Justified\")","v":0},{"$f":"COUNTIF('June-Raw'!J:J,\"Justified\")","v":0},{"$f":"COUNTIF('June-Raw'!L:L,\"Justified\")","v":0},{"$f":"COUNTIF('June-Raw'!N:N,\"Justified\")","v":0},{"$f":"COUNTIF('June-Raw'!P:P,\"Justified\")","v":0},{"$f":"COUNTIF('June-Raw'!R:R,\"Justified\")","v":0},{"$f":"COUNTIF('June-Raw'!T:T,\"Justified\")","v":1},{"$f":"COUNTIF('June-Raw'!V:V,\"Justified\")","v":0},{"$f":"COUNTIF('June-Raw'!X:X,\"Justified\")","v":1},{"$f":"COUNTIF('June-Raw'!Z:Z,\"Justified\")","v":0},{"$f":"COUNTIF('June-Raw'!AB:AB,\"Justified\")","v":0},{"$f":"COUNTIF('June-Raw'!AD:AD,\"Justified\")","v":0},{"$f":"COUNTIF('June-Raw'!AF:AF,\"Justified\")","v":0},{"$f":"COUNTIF('June-Raw'!AH:AH,\"Justified\")","v":0},{"$f":"COUNTIF('June-Raw'!AJ:AJ,\"Justified\")","v":0},{"$f":"COUNTIF('June-Raw'!AL:AL,\"Justified\")","v":0},{"$f":"COUNTIF('June-Raw'!AN:AN,\"Justified\")","v":0},{"$f":"COUNTIF('June-Raw'!AP:AP,\"Justified\")","v":0},{"$f":"COUNTIF('June-Raw'!AR:AR,\"Justified\")","v":0},{"$f":"COUNTIF('June-Raw'!AT:AT,\"Justified\")","v":0},{"$f":"COUNTIF('June-Raw'!AV:AV,\"Justified\")","v":0},{"$f":"COUNTIF('June-Raw'!AX:AX,\"Justified\")","v":0},{"$f":"COUNTIF('June-Raw'!AZ:AZ,\"Justified\")","v":0},{"$f":"COUNTIF('June-Raw'!BB:BB,\"Justified\")","v":0},{"$f":"COUNTIF('June-Raw'!BD:BD,\"Justified\")","v":0},{"$f":"COUNTIF('June-Raw'!BF:BF,\"Justified\")","v":0},{"$f":"COUNTIF('June-Raw'!BH:BH,\"Justified\")","v":0},{"$f":"COUNTIF('June-Raw'!BJ:BJ,\"Justified\")","v":0},{"$f":"COUNTIF('June-Raw'!BL:BL,\"Justified\")","v":0},{"$f":"COUNTIF('June-Raw'!BN:BN,\"Justified\")","v":0},{"$f":"COUNTIF('June-Raw'!BP:BP,\"Justified\")","v":0},{"$f":"COUNTIF('June-Raw'!BR:BR,\"Justified\")","v":0},{"$f":"COUNTIF('June-Raw'!BT:BT,\"Justified\")","v":0},{"$f":"COUNTIF('June-Raw'!BV:BV,\"Justified\")","v":0},{"$f":"COUNTIF('June-Raw'!BX:BX,\"Justified\")","v":0},{"$f":"COUNTIF('June-Raw'!BZ:BZ,\"Justified\")","v":0},{"$f":"COUNTIF('June-Raw'!CB:CB,\"Justified\")","v":0},{"$f":"COUNTIF('June-Raw'!CD:CD,\"Justified\")","v":0},{"$f":"COUNTIF('June-Raw'!CF:CF,\"Justified\")","v":0},{"$f":"COUNTIF('June-Raw'!CH:CH,\"Justified\")","v":0}]
["Total NA",{"$f":"COUNTIF('June-Raw'!H:H,\"NA\")","v":0},{"$f":"COUNTIF('June-Raw'!J:J,\"NA\")","v":0},{"$f":"COUNTIF('June-Raw'!L:L,\"NA\")","v":0},{"$f":"COUNTIF('June-Raw'!N:N,\"NA\")","v":0},{"$f":"COUNTIF('June-Raw'!P:P,\"NA\")","v":0},{"$f":"COUNTIF('June-Raw'!R:R,\"NA\")","v":0},{"$f":"COUNTIF('June-Raw'!T:T,\"NA\")","v":0},{"$f":"COUNTIF('June-Raw'!V:V,\"NA\")","v":0},{"$f":"COUNTIF('June-Raw'!X:X,\"NA\")","v":0},{"$f":"COUNTIF('June-Raw'!Z:Z,\"NA\")","v":0},{"$f":"COUNTIF('June-Raw'!AB:AB,\"NA\")","v":0},{"$f":"COUNTIF('June-Raw'!AD:AD,\"NA\")","v":0},{"$f":"COUNTIF('June-Raw'!AF:AF,\"NA\")","v":0},{"$f":"COUNTIF('June-Raw'!AH:AH,\"NA\")","v":0},{"$f":"COUNTIF('June-Raw'!AJ:AJ,\"NA\")","v":0},{"$f":"COUNTIF('June-Raw'!AL:AL,\"NA\")","v":0},{"$f":"COUNTIF('June-Raw'!AN:AN,\"NA\")","v":0},{"$f":"COUNTIF('June-Raw'!AP:AP,\"NA\")","v":0},{"$f":"COUNTIF('June-Raw'!AR:AR,\"NA\")","v":0},{"$f":"COUNTIF('June-Raw'!AT:AT,\"NA\")","v":0},{"$f":"COUNTIF('June-Raw'!AV:AV,\"NA\")","v":0},{"$f":"COUNTIF('June-Raw'!AX:AX,\"NA\")","v":0},{"$f":"COUNTIF('June-Raw'!AZ:AZ,\"NA\")","v":0},{"$f":"COUNTIF('June-Raw'!BB:BB,\"NA\")","v":0},{"$f":"COUNTIF('June-Raw'!BD:BD,\"NA\")","v":0},{"$f":"COUNTIF('June-Raw'!BF:BF,\"NA\")","v":0},{"$f":"COUNTIF('June-Raw'!BH:BH,\"NA\")","v":0},{"$f":"COUNTIF('June-Raw'!BJ:BJ,\"NA\")","v":0},{"$f":"COUNTIF('June-Raw'!BL:BL,\"NA\")","v":0},{"$f":"COUNTIF('June-Raw'!BN:BN,\"NA\")","v":0},{"$f":"COUNTIF('June-Raw'!BP:BP,\"NA\")","v":0},{"$f":"COUNTIF('June-Raw'!BR:BR,\"NA\")","v":0},{"$f":"COUNTIF('June-Raw'!BT:BT,\"NA\")","v":0},{"$f":"COUNTIF('June-Raw'!BV:BV,\"NA\")","v":0},{"$f":"COUNTIF('June-Raw'!BX:BX,\"NA\")","v":0},{"$f":"COUNTIF('June-Raw'!BZ:BZ,\"NA\")","v":0},{"$f":"COUNTIF('June-Raw'!CB:CB,\"NA\")","v":0},{"$f":"COUNTIF('June-Raw'!CD:CD,\"NA\")","v":0},{"$f":"COUNTIF('June-Raw'!CF:CF,\"NA\")","v":0},{"$f":"COUNTIF('June-Raw'!CH:CH,\"NA\")","v":0}]
["Blanks",{"$f":"B8-(SUM(B3:B6))","v":0},{"$f":"C8-(SUM(C3:C6))","v":0},0,0,0,0,0,0,0,0,0,5,5,5,5,5,5,5,5,5,5,5,5,5,5,5,5,5,5,5,5,5,5,5,5,5,5,5,5,5]
["full sample size",{"$f":"COUNTA('June-Raw'!A:A)-2","v":5},{"$f":"B8","v":5},5,5,5,5,5,5,5,5,5,5,5,5,5,5,5,5,5,5,5,5,5,5,5,5,5,5,5,5,5,5,5,5,5,5,5,5,5,5]
["True sample size (-NA + blanks)",{"$f":"IF(ISERROR(B8-(B6+B7)),\"\",B8-(B6+B7))","v":5},{"$f":"IF(ISERROR(C8-(C6+C7)),\"\",C8-(C6+C7))","v":5},5,5,5,5,5,5,5,5,5,0,0,0,0,0,0,0,0,0,0,0,0,0,0,0,0,0,0,0,0,0,0,0,0,0,0,0,0,0]
["%Y",{"$f":"IF(ISERROR(B3/B9),\"\",B3/B9)","v":1},{"$f":"IF(ISERROR(C3/C9),\"\",C3/C9)","v":1},0.8,1,1,1,0.8,1,0.8,1,1,"","","","","","","","","","","","","","","","","","","","","","","","","","","","",""]
["%N",{"$f":"IF(ISERROR(B4/B9),\"\",B4/B9)","v":0},{"$f":"IF(ISERROR(C4/C9),\"\",C4/C9)","v":0},0.2,0,0,0,0,0,0,0,0,"","","","","","","","","","","","","","","","","","","","","","","","","","","","",""]
["%N - Justified",{"$f":"IF(ISERROR(B5/B9),\"\",B5/B9)","v":0},{"$f":"IF(ISERROR(C5/C9),\"\",C5/C9)","v":0},0,0,0,0,0.2,0,0.2,0,0,"","","","","","","","","","","","","","","","","","","","","","","","","","","","",""]

{"sheet":"July","index":15,"n_rows":51,"n_cols":8,"rows_kept":51,"cut":false,"hidden":false,"merged":[]}
["Click here to go to year overview"]
[]
["Date",null,null,"Total by Apt type"]
["Completed by",null,null,"New",{"$f":"COUNTIF('July-Raw'!E3:E103,\"New\")","v":5}]
["Sample group size",{"$f":"COUNTA('July-Raw'!A:A)-2","v":5},null,"Follow up",{"$f":"COUNTIF('July-Raw'!E3:E103,\"Fup\")","v":0},null,null,{"$f":"Year!H5","v":0.95}]
["Overall Result (compliant only)",{"$f":"IF(ISERROR(SUM(D11:D50)/G51),\"\",SUM(D11:D50)/G51)","v":0.96363636363636362},null,"Total by apt Code",null,null,null,{"$f":"Year!H6","v":"80-95%"}]
["Overall Result (compliant & Justified)",{"$f":"IF(ISERROR(SUM(C11:C50)/G51),\"\",SUM(C11:C50)/G51)","v":0.98181818181818192},null,"code goes in here",{"$f":"COUNTIF('July-Raw'!F3:F103,D7)","v":0},null,null,{"$f":"Year!H7","v":0.8}]
["viable qs",{"$f":"G51","v":11}]
[]
["Metric","Target %","Compliant + Justified","Compliant","Justified","Not compliant","Irritating math"]
[{"$f":"IF(ISERROR(Q!A2),\"\",Q!A2)","v":"Was a Room number documented?"},{"$f":"IF(ISERROR(Q!B2),\"\",Q!B2)","v":0},{"$f":"IF(ISERROR(D11+E11),\"\",D11+E11)","v":1},{"$f":"'July-Data'!B10","v":1},{"$f":"'July-Data'!B12","v":0},{"$f":"'July-Data'!B11","v":0},{"$f":"COUNTIF(D11:F11,\">0\")","v":1}]
[{"$f":"IF(ISERROR(Q!A3),\"\",Q!A3)","v":"Were stage A checks completed as appropriate?"},{"$f":"IF(ISERROR(Q!B3),\"\",Q!B3)","v":0},1,{"$f":"'July-Data'!C10","v":1},{"$f":"'July-Data'!C12","v":0},{"$f":"'July-Data'!C11","v":0},1]
[{"$f":"IF(ISERROR(Q!A4),\"\",Q!A4)","v":"Was COSI Part 1 performed?"},{"$f":"IF(ISERROR(Q!B4),\"\",Q!B4)","v":0},0.8,{"$f":"'July-Data'!D10","v":0.8},{"$f":"'July-Data'!D12","v":0},{"$f":"'July-Data'!D11","v":0.2},2]
[{"$f":"IF(ISERROR(Q!A5),\"\",Q!A5)","v":"Was PVP documented?"},{"$f":"IF(ISERROR(Q!B5),\"\",Q!B5)","v":0},1,{"$f":"'July-Data'!E10","v":1},{"$f":"'July-Data'!E12","v":0},{"$f":"'July-Data'!E11","v":0},1]
[{"$f":"IF(ISERROR(Q!A6),\"\",Q!A6)","v":"Was Otoscopy documented?"},{"$f":"IF(ISERROR(Q!B6),\"\",Q!B6)","v":0},1,{"$f":"'July-Data'!F10","v":1},{"$f":"'July-Data'!F12","v":0},{"$f":"'July-Data'!F11","v":0},1]
[{"$f":"IF(ISERROR(Q!A7),\"\",Q!A7)","v":"Document bc at 3 & 4kHz is for programming purposes?"},{"$f":"IF(ISERROR(Q!B7),\"\",Q!B7)","v":0},1,{"$f":"'July-Data'!G10","v":1},{"$f":"'July-Data'!G12","v":0},{"$f":"'July-Data'!G11","v":0},1]
[{"$f":"IF(ISERROR(Q!A8),\"\",Q!A8)","v":"Was Speech testing performed?"},{"$f":"IF(ISERROR(Q!B8),\"\",Q!B8)","v":0},1,{"$f":"'July-Data'!H10","v":0.8},{"$f":"'July-Data'!H12","v":0.2},{"$f":"'July-Data'!H11","v":0},2]
[{"$f":"IF(ISERROR(Q!A9),\"\",Q!A9)","v":"Is it documented whether national criteria were/were not met?"},{"$f":"IF(ISERROR(Q!B9),\"\",Q!B9)","v":0},1,{"$f":"'July-Data'!I10","v":1},{"$f":"'July-Data'!I12","v":0},{"$f":"'July-Data'!I11","v":0},1]
[{"$f":"IF(ISERROR(Q!A10),\"\",Q!A10)","v":"Was a BCHI info pack supplied?"},{"$f":"IF(ISERROR(Q!B10),\"\",Q!B10)","v":0},1,{"$f":"'July-Data'!J10","v":1},{"$f":"'July-Data'!J12","v":0},{"$f":"'July-Data'!J11","v":0},1]
[{"$f":"IF(ISERROR(Q!A11),\"\",Q!A11)","v":"Was the report authorised & issued within target (7 days)?"},{"$f":"IF(ISERROR(Q!B11),\"\",Q!B11)","v":0},1,{"$f":"'July-Data'!K10","v":1},{"$f":"'July-Data'!K12","v":0},{"$f":"'July-Data'!K11","v":0},1]
[{"$f":"IF(ISERROR(Q!A12),\"\",Q!A12)","v":"Was consent documented as appropriate?"},{"$f":"IF(ISERROR(Q!B12),\"\",Q!B12)","v":0},1,{"$f":"'July-Data'!L10","v":1},{"$f":"'July-Data'!L12","v":0},{"$f":"'July-Data'!L11","v":0},1]
[{"$f":"IF(ISERROR(Q!A13),\"\",Q!A13)","v":0},{"$f":"IF(ISERROR(Q!B13),\"\",Q!B13)","v":0},"",{"$f":"'July-Data'!M10","v":""},{"$f":"'July-Data'!M12","v":""},{"$f":"'July-Data'!M11","v":""},0]
[{"$f":"IF(ISERROR(Q!A14),\"\",Q!A14)","v":0},{"$f":"IF(ISERROR(Q!B14),\"\",Q!B14)","v":0},"",{"$f":"'July-Data'!N10","v":""},{"$f":"'July-Data'!N12","v":""},{"$f":"'July-Data'!N11","v":""},0]
[{"$f":"IF(ISERROR(Q!A15),\"\",Q!A15)","v":0},{"$f":"IF(ISERROR(Q!B15),\"\",Q!B15)","v":0},"",{"$f":"'July-Data'!O10","v":""},{"$f":"'July-Data'!O12","v":""},{"$f":"'July-Data'!O11","v":""},0]
[{"$f":"IF(ISERROR(Q!A16),\"\",Q!A16)","v":0},{"$f":"IF(ISERROR(Q!B16),\"\",Q!B16)","v":0},"",{"$f":"'July-Data'!P10","v":""},{"$f":"'July-Data'!P12","v":""},{"$f":"'July-Data'!P11","v":""},0]
[{"$f":"IF(ISERROR(Q!A17),\"\",Q!A17)","v":0},{"$f":"IF(ISERROR(Q!B17),\"\",Q!B17)","v":0},"",{"$f":"'July-Data'!Q10","v":""},{"$f":"'July-Data'!Q12","v":""},{"$f":"'July-Data'!Q11","v":""},0]
[{"$f":"IF(ISERROR(Q!A18),\"\",Q!A18)","v":0},{"$f":"IF(ISERROR(Q!B18),\"\",Q!B18)","v":0},"",{"$f":"'July-Data'!R10","v":""},{"$f":"'July-Data'!R12","v":""},{"$f":"'July-Data'!R11","v":""},0]
[{"$f":"IF(ISERROR(Q!A19),\"\",Q!A19)","v":0},{"$f":"IF(ISERROR(Q!B19),\"\",Q!B19)","v":0},"",{"$f":"'July-Data'!S10","v":""},{"$f":"'July-Data'!S12","v":""},{"$f":"'July-Data'!S11","v":""},0]
[{"$f":"IF(ISERROR(Q!A20),\"\",Q!A20)","v":0},{"$f":"IF(ISERROR(Q!B20),\"\",Q!B20)","v":0},"",{"$f":"'July-Data'!T10","v":""},{"$f":"'July-Data'!T12","v":""},{"$f":"'July-Data'!T11","v":""},0]
[{"$f":"IF(ISERROR(Q!A21),\"\",Q!A21)","v":0},{"$f":"IF(ISERROR(Q!B21),\"\",Q!B21)","v":0},"",{"$f":"'July-Data'!U10","v":""},{"$f":"'July-Data'!U12","v":""},{"$f":"'July-Data'!U11","v":""},0]
[{"$f":"IF(ISERROR(Q!A22),\"\",Q!A22)","v":0},{"$f":"IF(ISERROR(Q!B22),\"\",Q!B22)","v":0},"",{"$f":"'July-Data'!V10","v":""},{"$f":"'July-Data'!V12","v":""},{"$f":"'July-Data'!V11","v":""},0]
[{"$f":"IF(ISERROR(Q!A23),\"\",Q!A23)","v":0},{"$f":"IF(ISERROR(Q!B23),\"\",Q!B23)","v":0},"",{"$f":"'July-Data'!W10","v":""},{"$f":"'July-Data'!W12","v":""},{"$f":"'July-Data'!W11","v":""},0]
[{"$f":"IF(ISERROR(Q!A24),\"\",Q!A24)","v":0},{"$f":"IF(ISERROR(Q!B24),\"\",Q!B24)","v":0},"",{"$f":"'July-Data'!X10","v":""},{"$f":"'July-Data'!X12","v":""},{"$f":"'July-Data'!X11","v":""},0]
[{"$f":"IF(ISERROR(Q!A25),\"\",Q!A25)","v":0},{"$f":"IF(ISERROR(Q!B25),\"\",Q!B25)","v":0},"",{"$f":"'July-Data'!Y10","v":""},{"$f":"'July-Data'!Y12","v":""},{"$f":"'July-Data'!Y11","v":""},0]
[{"$f":"IF(ISERROR(Q!A26),\"\",Q!A26)","v":0},{"$f":"IF(ISERROR(Q!B26),\"\",Q!B26)","v":0},"",{"$f":"'July-Data'!Z10","v":""},{"$f":"'July-Data'!Z12","v":""},{"$f":"'July-Data'!Z11","v":""},0]
[{"$f":"IF(ISERROR(Q!A27),\"\",Q!A27)","v":0},{"$f":"IF(ISERROR(Q!B27),\"\",Q!B27)","v":0},"",{"$f":"'July-Data'!AA10","v":""},{"$f":"'July-Data'!AA12","v":""},{"$f":"'July-Data'!AA11","v":""},0]
[{"$f":"IF(ISERROR(Q!A28),\"\",Q!A28)","v":0},{"$f":"IF(ISERROR(Q!B28),\"\",Q!B28)","v":0},"",{"$f":"'July-Data'!AB10","v":""},{"$f":"'July-Data'!AB12","v":""},{"$f":"'July-Data'!AB11","v":""},0]
[{"$f":"IF(ISERROR(Q!A29),\"\",Q!A29)","v":0},{"$f":"IF(ISERROR(Q!B29),\"\",Q!B29)","v":0},"",{"$f":"'July-Data'!AC10","v":""},{"$f":"'July-Data'!AC12","v":""},{"$f":"'July-Data'!AC11","v":""},0]
[{"$f":"IF(ISERROR(Q!A30),\"\",Q!A30)","v":0},{"$f":"IF(ISERROR(Q!B30),\"\",Q!B30)","v":0},"",{"$f":"'July-Data'!AD10","v":""},{"$f":"'July-Data'!AD12","v":""},{"$f":"'July-Data'!AD11","v":""},0]
[{"$f":"IF(ISERROR(Q!A31),\"\",Q!A31)","v":0},{"$f":"IF(ISERROR(Q!B31),\"\",Q!B31)","v":0},"",{"$f":"'July-Data'!AE10","v":""},{"$f":"'July-Data'!AE12","v":""},{"$f":"'July-Data'!AE11","v":""},0]
[{"$f":"IF(ISERROR(Q!A32),\"\",Q!A32)","v":0},{"$f":"IF(ISERROR(Q!B32),\"\",Q!B32)","v":0},"",{"$f":"'July-Data'!AF10","v":""},{"$f":"'July-Data'!AF12","v":""},{"$f":"'July-Data'!AF11","v":""},0]
[{"$f":"IF(ISERROR(Q!A33),\"\",Q!A33)","v":0},{"$f":"IF(ISERROR(Q!B33),\"\",Q!B33)","v":0},"",{"$f":"'July-Data'!AG10","v":""},{"$f":"'July-Data'!AG12","v":""},{"$f":"'July-Data'!AG11","v":""},0]
[{"$f":"IF(ISERROR(Q!A34),\"\",Q!A34)","v":0},{"$f":"IF(ISERROR(Q!B34),\"\",Q!B34)","v":0},"",{"$f":"'July-Data'!AH10","v":""},{"$f":"'July-Data'!AH12","v":""},{"$f":"'July-Data'!AH11","v":""},0]
[{"$f":"IF(ISERROR(Q!A35),\"\",Q!A35)","v":0},{"$f":"IF(ISERROR(Q!B35),\"\",Q!B35)","v":0},"",{"$f":"'July-Data'!AI10","v":""},{"$f":"'July-Data'!AI12","v":""},{"$f":"'July-Data'!AI11","v":""},0]
[{"$f":"IF(ISERROR(Q!A36),\"\",Q!A36)","v":0},{"$f":"IF(ISERROR(Q!B36),\"\",Q!B36)","v":0},"",{"$f":"'July-Data'!AJ10","v":""},{"$f":"'July-Data'!AJ12","v":""},{"$f":"'July-Data'!AJ11","v":""},0]
[{"$f":"IF(ISERROR(Q!A37),\"\",Q!A37)","v":0},{"$f":"IF(ISERROR(Q!B37),\"\",Q!B37)","v":0},"",{"$f":"'July-Data'!AK10","v":""},{"$f":"'July-Data'!AK12","v":""},{"$f":"'July-Data'!AK11","v":""},0]
[{"$f":"IF(ISERROR(Q!A38),\"\",Q!A38)","v":0},{"$f":"IF(ISERROR(Q!B38),\"\",Q!B38)","v":0},"",{"$f":"'July-Data'!AL10","v":""},{"$f":"'July-Data'!AL12","v":""},{"$f":"'July-Data'!AL11","v":""},0]
[{"$f":"IF(ISERROR(Q!A39),\"\",Q!A39)","v":0},{"$f":"IF(ISERROR(Q!B39),\"\",Q!B39)","v":0},"",{"$f":"'July-Data'!AM10","v":""},{"$f":"'July-Data'!AM12","v":""},{"$f":"'July-Data'!AM11","v":""},0]
[{"$f":"IF(ISERROR(Q!A40),\"\",Q!A40)","v":0},{"$f":"IF(ISERROR(Q!B40),\"\",Q!B40)","v":0},"",{"$f":"'July-Data'!AN10","v":""},{"$f":"'July-Data'!AN12","v":""},{"$f":"'July-Data'!AN11","v":""},0]
[{"$f":"IF(ISERROR(Q!A41),\"\",Q!A41)","v":0},{"$f":"IF(ISERROR(Q!B41),\"\",Q!B41)","v":0},"",{"$f":"'July-Data'!AO10","v":""},{"$f":"'July-Data'!AO12","v":""},{"$f":"'July-Data'!AO11","v":""},0]
[null,null,null,null,null,null,{"$f":"COUNTIF(G11:G50,\">=1\")","v":11}]

{"sheet":"July-Raw","index":16,"n_rows":7,"n_cols":87,"rows_kept":7,"cut":false,"hidden":true,"merged":[[0,85,0,86],[0,63,0,64],[0,65,0,66],[0,67,0,68],[0,69,0,70],[0,71,0,72],[0,73,0,74],[0,75,0,76],[0,77,0,78],[0,79,0,80],[0,81,0,82],[0,83,0,84],[0,61,0,62],[0,39,0,40],[0,41,0,42],[0,43,0,44],[0,45,0,46],[0,47,0,48],[0,49,0,50],[0,51,0,52],[0,53,0,54],[0,55,0,56],[0,57,0,58],[0,59,0,60],[0,37,0,38],[0,15,0,16],[0,17,0,18],[0,19,0,20],[0,21,0,22],[0,23,0,24],[0,25,0,26],[0,27,0,28],[0,29,0,30],[0,31,0,32],[0,33,0,34],[0,35,0,36],[0,13,0,14],[0,0,0,5],[0,6,1,6],[0,7,0,8],[0,9,0,10],[0,11,0,12]]}
["Record details",null,null,null,null,null,"Notes",{"$f":"Q!A2","v":"Was a Room number documented?"},null,{"$f":"Q!A3","v":"Were stage A checks completed as appropriate?"},null,{"$f":"Q!A4","v":"Was COSI Part 1 performed?"},null,{"$f":"Q!A5","v":"Was PVP documented?"},null,{"$f":"Q!A6","v":"Was Otoscopy documented?"},null,{"$f":"Q!A7","v":"Document bc at 3 & 4kHz is for programming purposes?"},null,{"$f":"Q!A8","v":"Was Speech testing performed?"},null,{"$f":"Q!A9","v":"Is it documented whether national criteria were/were not met?"},null,{"$f":"Q!A10","v":"Was a BCHI info pack supplied?"},null,{"$f":"Q!A11","v":"Was the report authorised & issued within target (7 days)?"},null,{"$f":"Q!A12","v":"Was consent documented as appropriate?"},null,{"$f":"Q!A13","v":0},null,{"$f":"Q!A14","v":0},null,{"$f":"Q!A15","v":0},null,{"$f":"Q!A16","v":0},null,{"$f":"Q!A17","v":0},null,{"$f":"Q!A18","v":0},null,{"$f":"Q!A19","v":0},null,{"$f":"Q!A20","v":0},null,{"$f":"Q!A21","v":0},null,{"$f":"Q!A22","v":0},null,{"$f":"Q!A23","v":0},null,{"$f":"Q!A24","v":0},null,{"$f":"Q!A25","v":0},null,{"$f":"Q!A26","v":0},null,{"$f":"Q!A27","v":0},null,{"$f":"Q!A28","v":0},null,{"$f":"Q!A29","v":0},null,{"$f":"Q!A30","v":0},null,{"$f":"Q!A31","v":0},null,{"$f":"Q!A32","v":0},null,{"$f":"Q!A33","v":0},null,{"$f":"Q!A34","v":0},null,{"$f":"Q!A35","v":0},null,{"$f":"Q!A36","v":0},null,{"$f":"Q!A37","v":0},null,{"$f":"Q!A38","v":0},null,{"$f":"Q!A39","v":0},null,{"$f":"Q!A40","v":0},null,{"$f":"Q!A41","v":0}]
["Pt number","Date seen","Clinician 1","clinician 2","New/ F-up","Apt code",null,"Compliant?","Other result","Compliant?","Other result","Compliant?","Other result","Compliant?","Other result","Compliant?","Other result","Compliant?","Other result","Compliant?","Other result","Compliant?","Other result","Compliant?","Other result","Compliant?","Other result","Compliant?","Other result","Compliant?","Other result","Compliant?","Other result","Compliant?","Other result","Compliant?","Other result","Compliant?","Other result","Compliant?","Other result","Compliant?","Other result","Compliant?","Other result","Compliant?","Other result","Compliant?","Other result","Compliant?","Other result","Compliant?","Other result","Compliant?","Other result","Compliant?","Other result","Compliant?","Other result","Compliant?","Other result","Compliant?","Other result","Compliant?","Other result","Compliant?","Other result","Compliant?","Other result","Compliant?","Other result","Compliant?","Other result","Compliant?","Other result","Compliant?","Other result","Compliant?","Other result","Compliant?","Other result","Compliant?","Other result","Compliant?","Other result","Compliant?","Other result"]
["AB0001","2023-07-07","AA",null,"New","BA",null,"Yes",null,"Yes",null,"No",null,"Yes",null,"Yes",null,"Yes",null,"Yes",null,"Yes",null,"Yes",null,"Yes",null,"Yes"]
["AB0002","2023-07-17","AA",null,"New","BA",null,"Yes",null,"Yes",null,"Yes",null,"Yes",null,"Yes",null,"Yes",null,"Yes",null,"Yes",null,"Yes",null,"Yes",null,"Yes"]
["AB0003","2023-07-24","BB",null,"New","BA",null,"Yes",null,"Yes",null,"Yes",null,"Yes",null,"Yes",null,"Yes",null,"Yes",null,"Yes",null,"Yes",null,"Yes",null,"Yes"]
["AB0004","2023-07-26","BB",null,"New","BA",null,"Yes",null,"Yes",null,"Yes",null,"Yes",null,"Yes",null,"Yes",null,"Justified","Pt has poor speech so unable to correctly score","Yes",null,"Yes",null,"Yes",null,"Yes"]
["AB0005","2023-07-28","CC",null,"New","BA",null,"Yes",null,"Yes",null,"Yes",null,"Yes",null,"Yes",null,"Yes",null,"Yes",null,"Yes",null,"Yes",null,"Yes",null,"Yes"]

{"sheet":"July-Data","index":17,"n_rows":12,"n_cols":41,"rows_kept":12,"cut":false,"hidden":true,"merged":[[0,0,1,0]]}
["Results",{"$f":"Q!A2","v":"Was a Room number documented?"},{"$f":"Q!A3","v":"Were stage A checks completed as appropriate?"},{"$f":"Q!A4","v":"Was COSI Part 1 performed?"},{"$f":"Q!A5","v":"Was PVP documented?"},{"$f":"Q!A6","v":"Was Otoscopy documented?"},{"$f":"Q!A7","v":"Document bc at 3 & 4kHz is for programming purposes?"},{"$f":"Q!A8","v":"Was Speech testing performed?"},{"$f":"Q!A9","v":"Is it documented whether national criteria were/were not met?"},{"$f":"Q!A10","v":"Was a BCHI info pack supplied?"},{"$f":"Q!A11","v":"Was the report authorised & issued within target (7 days)?"},{"$f":"Q!A12","v":"Was consent documented as appropriate?"},{"$f":"Q!A13","v":0},{"$f":"Q!A14","v":0},{"$f":"Q!A15","v":0},{"$f":"Q!A16","v":0},{"$f":"Q!A17","v":0},{"$f":"Q!A18","v":0},{"$f":"Q!A19","v":0},{"$f":"Q!A20","v":0},{"$f":"Q!A21","v":0},{"$f":"Q!A22","v":0},{"$f":"Q!A23","v":0},{"$f":"Q!A24","v":0},{"$f":"Q!A25","v":0},{"$f":"Q!A26","v":0},{"$f":"Q!A27","v":0},{"$f":"Q!A28","v":0},{"$f":"Q!A29","v":0},{"$f":"Q!A30","v":0},{"$f":"Q!A31","v":0},{"$f":"Q!A32","v":0},{"$f":"Q!A33","v":0},{"$f":"Q!A34","v":0},{"$f":"Q!A35","v":0},{"$f":"Q!A36","v":0},{"$f":"Q!A37","v":0},{"$f":"Q!A38","v":0},{"$f":"Q!A39","v":0},{"$f":"Q!A40","v":0},{"$f":"Q!A41","v":0}]
[null,"Compliant?","Compliant?","Compliant?","Compliant?","Compliant?","Compliant?","Compliant?","Compliant?","Compliant?","Compliant?","Compliant?","Compliant?","Compliant?","Compliant?","Compliant?","Compliant?","Compliant?","Compliant?","Compliant?","Compliant?","Compliant?","Compliant?","Compliant?","Compliant?","Compliant?","Compliant?","Compliant?","Compliant?","Compliant?","Compliant?","Compliant?","Compliant?","Compliant?","Compliant?","Compliant?","Compliant?","Compliant?","Compliant?","Compliant?","Compliant?"]
["Total Y",{"$f":"COUNTIF('July-Raw'!H:H,\"yes\")","v":5},{"$f":"COUNTIF('July-Raw'!J:J,\"yes\")","v":5},{"$f":"COUNTIF('July-Raw'!L:L,\"yes\")","v":4},{"$f":"COUNTIF('July-Raw'!N:N,\"yes\")","v":5},{"$f":"COUNTIF('July-Raw'!P:P,\"yes\")","v":5},{"$f":"COUNTIF('July-Raw'!R:R,\"yes\")","v":5},{"$f":"COUNTIF('July-Raw'!T:T,\"yes\")","v":4},{"$f":"COUNTIF('July-Raw'!V:V,\"yes\")","v":5},{"$f":"COUNTIF('July-Raw'!X:X,\"yes\")","v":5},{"$f":"COUNTIF('July-Raw'!Z:Z,\"yes\")","v":5},{"$f":"COUNTIF('July-Raw'!AB:AB,\"yes\")","v":5},{"$f":"COUNTIF('July-Raw'!AD:AD,\"yes\")","v":0},{"$f":"COUNTIF('July-Raw'!AF:AF,\"yes\")","v":0},{"$f":"COUNTIF('July-Raw'!AH:AH,\"yes\")","v":0},{"$f":"COUNTIF('July-Raw'!AJ:AJ,\"yes\")","v":0},{"$f":"COUNTIF('July-Raw'!AL:AL,\"yes\")","v":0},{"$f":"COUNTIF('July-Raw'!AN:AN,\"yes\")","v":0},{"$f":"COUNTIF('July-Raw'!AP:AP,\"yes\")","v":0},{"$f":"COUNTIF('July-Raw'!AR:AR,\"yes\")","v":0},{"$f":"COUNTIF('July-Raw'!AT:AT,\"yes\")","v":0},{"$f":"COUNTIF('July-Raw'!AV:AV,\"yes\")","v":0},{"$f":"COUNTIF('July-Raw'!AX:AX,\"yes\")","v":0},{"$f":"COUNTIF('July-Raw'!AZ:AZ,\"yes\")","v":0},{"$f":"COUNTIF('July-Raw'!BB:BB,\"yes\")","v":0},{"$f":"COUNTIF('July-Raw'!BD:BD,\"yes\")","v":0},{"$f":"COUNTIF('July-Raw'!BF:BF,\"yes\")","v":0},{"$f":"COUNTIF('July-Raw'!BH:BH,\"yes\")","v":0},{"$f":"COUNTIF('July-Raw'!BJ:BJ,\"yes\")","v":0},{"$f":"COUNTIF('July-Raw'!BL:BL,\"yes\")","v":0},{"$f":"COUNTIF('July-Raw'!BN:BN,\"yes\")","v":0},{"$f":"COUNTIF('July-Raw'!BP:BP,\"yes\")","v":0},{"$f":"COUNTIF('July-Raw'!BR:BR,\"yes\")","v":0},{"$f":"COUNTIF('July-Raw'!BT:BT,\"yes\")","v":0},{"$f":"COUNTIF('July-Raw'!BV:BV,\"yes\")","v":0},{"$f":"COUNTIF('July-Raw'!BX:BX,\"yes\")","v":0},{"$f":"COUNTIF('July-Raw'!BZ:BZ,\"yes\")","v":0},{"$f":"COUNTIF('July-Raw'!CB:CB,\"yes\")","v":0},{"$f":"COUNTIF('July-Raw'!CD:CD,\"yes\")","v":0},{"$f":"COUNTIF('July-Raw'!CF:CF,\"yes\")","v":0},{"$f":"COUNTIF('July-Raw'!CH:CH,\"yes\")","v":0}]
["Total N",{"$f":"COUNTIF('July-Raw'!H:H,\"no\")","v":0},{"$f":"COUNTIF('July-Raw'!J:J,\"no\")","v":0},{"$f":"COUNTIF('July-Raw'!L:L,\"no\")","v":1},{"$f":"COUNTIF('July-Raw'!N:N,\"no\")","v":0},{"$f":"COUNTIF('July-Raw'!P:P,\"no\")","v":0},{"$f":"COUNTIF('July-Raw'!R:R,\"no\")","v":0},{"$f":"COUNTIF('July-Raw'!T:T,\"no\")","v":0},{"$f":"COUNTIF('July-Raw'!V:V,\"no\")","v":0},{"$f":"COUNTIF('July-Raw'!X:X,\"no\")","v":0},{"$f":"COUNTIF('July-Raw'!Z:Z,\"no\")","v":0},{"$f":"COUNTIF('July-Raw'!AB:AB,\"no\")","v":0},{"$f":"COUNTIF('July-Raw'!AD:AD,\"no\")","v":0},{"$f":"COUNTIF('July-Raw'!AF:AF,\"no\")","v":0},{"$f":"COUNTIF('July-Raw'!AH:AH,\"no\")","v":0},{"$f":"COUNTIF('July-Raw'!AJ:AJ,\"no\")","v":0},{"$f":"COUNTIF('July-Raw'!AL:AL,\"no\")","v":0},{"$f":"COUNTIF('July-Raw'!AN:AN,\"no\")","v":0},{"$f":"COUNTIF('July-Raw'!AP:AP,\"no\")","v":0},{"$f":"COUNTIF('July-Raw'!AR:AR,\"no\")","v":0},{"$f":"COUNTIF('July-Raw'!AT:AT,\"no\")","v":0},{"$f":"COUNTIF('July-Raw'!AV:AV,\"no\")","v":0},{"$f":"COUNTIF('July-Raw'!AX:AX,\"no\")","v":0},{"$f":"COUNTIF('July-Raw'!AZ:AZ,\"no\")","v":0},{"$f":"COUNTIF('July-Raw'!BB:BB,\"no\")","v":0},{"$f":"COUNTIF('July-Raw'!BD:BD,\"no\")","v":0},{"$f":"COUNTIF('July-Raw'!BF:BF,\"no\")","v":0},{"$f":"COUNTIF('July-Raw'!BH:BH,\"no\")","v":0},{"$f":"COUNTIF('July-Raw'!BJ:BJ,\"no\")","v":0},{"$f":"COUNTIF('July-Raw'!BL:BL,\"no\")","v":0},{"$f":"COUNTIF('July-Raw'!BN:BN,\"no\")","v":0},{"$f":"COUNTIF('July-Raw'!BP:BP,\"no\")","v":0},{"$f":"COUNTIF('July-Raw'!BR:BR,\"no\")","v":0},{"$f":"COUNTIF('July-Raw'!BT:BT,\"no\")","v":0},{"$f":"COUNTIF('July-Raw'!BV:BV,\"no\")","v":0},{"$f":"COUNTIF('July-Raw'!BX:BX,\"no\")","v":0},{"$f":"COUNTIF('July-Raw'!BZ:BZ,\"no\")","v":0},{"$f":"COUNTIF('July-Raw'!CB:CB,\"no\")","v":0},{"$f":"COUNTIF('July-Raw'!CD:CD,\"no\")","v":0},{"$f":"COUNTIF('July-Raw'!CF:CF,\"no\")","v":0},{"$f":"COUNTIF('July-Raw'!CH:CH,\"no\")","v":0}]
["Total Justified",{"$f":"COUNTIF('July-Raw'!H:H,\"Justified\")","v":0},{"$f":"COUNTIF('July-Raw'!J:J,\"Justified\")","v":0},{"$f":"COUNTIF('July-Raw'!L:L,\"Justified\")","v":0},{"$f":"COUNTIF('July-Raw'!N:N,\"Justified\")","v":0},{"$f":"COUNTIF('July-Raw'!P:P,\"Justified\")","v":0},{"$f":"COUNTIF('July-Raw'!R:R,\"Justified\")","v":0},{"$f":"COUNTIF('July-Raw'!T:T,\"Justified\")","v":1},{"$f":"COUNTIF('July-Raw'!V:V,\"Justified\")","v":0},{"$f":"COUNTIF('July-Raw'!X:X,\"Justified\")","v":0},{"$f":"COUNTIF('July-Raw'!Z:Z,\"Justified\")","v":0},{"$f":"COUNTIF('July-Raw'!AB:AB,\"Justified\")","v":0},{"$f":"COUNTIF('July-Raw'!AD:AD,\"Justified\")","v":0},{"$f":"COUNTIF('July-Raw'!AF:AF,\"Justified\")","v":0},{"$f":"COUNTIF('July-Raw'!AH:AH,\"Justified\")","v":0},{"$f":"COUNTIF('July-Raw'!AJ:AJ,\"Justified\")","v":0},{"$f":"COUNTIF('July-Raw'!AL:AL,\"Justified\")","v":0},{"$f":"COUNTIF('July-Raw'!AN:AN,\"Justified\")","v":0},{"$f":"COUNTIF('July-Raw'!AP:AP,\"Justified\")","v":0},{"$f":"COUNTIF('July-Raw'!AR:AR,\"Justified\")","v":0},{"$f":"COUNTIF('July-Raw'!AT:AT,\"Justified\")","v":0},{"$f":"COUNTIF('July-Raw'!AV:AV,\"Justified\")","v":0},{"$f":"COUNTIF('July-Raw'!AX:AX,\"Justified\")","v":0},{"$f":"COUNTIF('July-Raw'!AZ:AZ,\"Justified\")","v":0},{"$f":"COUNTIF('July-Raw'!BB:BB,\"Justified\")","v":0},{"$f":"COUNTIF('July-Raw'!BD:BD,\"Justified\")","v":0},{"$f":"COUNTIF('July-Raw'!BF:BF,\"Justified\")","v":0},{"$f":"COUNTIF('July-Raw'!BH:BH,\"Justified\")","v":0},{"$f":"COUNTIF('July-Raw'!BJ:BJ,\"Justified\")","v":0},{"$f":"COUNTIF('July-Raw'!BL:BL,\"Justified\")","v":0},{"$f":"COUNTIF('July-Raw'!BN:BN,\"Justified\")","v":0},{"$f":"COUNTIF('July-Raw'!BP:BP,\"Justified\")","v":0},{"$f":"COUNTIF('July-Raw'!BR:BR,\"Justified\")","v":0},{"$f":"COUNTIF('July-Raw'!BT:BT,\"Justified\")","v":0},{"$f":"COUNTIF('July-Raw'!BV:BV,\"Justified\")","v":0},{"$f":"COUNTIF('July-Raw'!BX:BX,\"Justified\")","v":0},{"$f":"COUNTIF('July-Raw'!BZ:BZ,\"Justified\")","v":0},{"$f":"COUNTIF('July-Raw'!CB:CB,\"Justified\")","v":0},{"$f":"COUNTIF('July-Raw'!CD:CD,\"Justified\")","v":0},{"$f":"COUNTIF('July-Raw'!CF:CF,\"Justified\")","v":0},{"$f":"COUNTIF('July-Raw'!CH:CH,\"Justified\")","v":0}]
["Total NA",{"$f":"COUNTIF('July-Raw'!H:H,\"NA\")","v":0},{"$f":"COUNTIF('July-Raw'!J:J,\"NA\")","v":0},{"$f":"COUNTIF('July-Raw'!L:L,\"NA\")","v":0},{"$f":"COUNTIF('July-Raw'!N:N,\"NA\")","v":0},{"$f":"COUNTIF('July-Raw'!P:P,\"NA\")","v":0},{"$f":"COUNTIF('July-Raw'!R:R,\"NA\")","v":0},{"$f":"COUNTIF('July-Raw'!T:T,\"NA\")","v":0},{"$f":"COUNTIF('July-Raw'!V:V,\"NA\")","v":0},{"$f":"COUNTIF('July-Raw'!X:X,\"NA\")","v":0},{"$f":"COUNTIF('July-Raw'!Z:Z,\"NA\")","v":0},{"$f":"COUNTIF('July-Raw'!AB:AB,\"NA\")","v":0},{"$f":"COUNTIF('July-Raw'!AD:AD,\"NA\")","v":0},{"$f":"COUNTIF('July-Raw'!AF:AF,\"NA\")","v":0},{"$f":"COUNTIF('July-Raw'!AH:AH,\"NA\")","v":0},{"$f":"COUNTIF('July-Raw'!AJ:AJ,\"NA\")","v":0},{"$f":"COUNTIF('July-Raw'!AL:AL,\"NA\")","v":0},{"$f":"COUNTIF('July-Raw'!AN:AN,\"NA\")","v":0},{"$f":"COUNTIF('July-Raw'!AP:AP,\"NA\")","v":0},{"$f":"COUNTIF('July-Raw'!AR:AR,\"NA\")","v":0},{"$f":"COUNTIF('July-Raw'!AT:AT,\"NA\")","v":0},{"$f":"COUNTIF('July-Raw'!AV:AV,\"NA\")","v":0},{"$f":"COUNTIF('July-Raw'!AX:AX,\"NA\")","v":0},{"$f":"COUNTIF('July-Raw'!AZ:AZ,\"NA\")","v":0},{"$f":"COUNTIF('July-Raw'!BB:BB,\"NA\")","v":0},{"$f":"COUNTIF('July-Raw'!BD:BD,\"NA\")","v":0},{"$f":"COUNTIF('July-Raw'!BF:BF,\"NA\")","v":0},{"$f":"COUNTIF('July-Raw'!BH:BH,\"NA\")","v":0},{"$f":"COUNTIF('July-Raw'!BJ:BJ,\"NA\")","v":0},{"$f":"COUNTIF('July-Raw'!BL:BL,\"NA\")","v":0},{"$f":"COUNTIF('July-Raw'!BN:BN,\"NA\")","v":0},{"$f":"COUNTIF('July-Raw'!BP:BP,\"NA\")","v":0},{"$f":"COUNTIF('July-Raw'!BR:BR,\"NA\")","v":0},{"$f":"COUNTIF('July-Raw'!BT:BT,\"NA\")","v":0},{"$f":"COUNTIF('July-Raw'!BV:BV,\"NA\")","v":0},{"$f":"COUNTIF('July-Raw'!BX:BX,\"NA\")","v":0},{"$f":"COUNTIF('July-Raw'!BZ:BZ,\"NA\")","v":0},{"$f":"COUNTIF('July-Raw'!CB:CB,\"NA\")","v":0},{"$f":"COUNTIF('July-Raw'!CD:CD,\"NA\")","v":0},{"$f":"COUNTIF('July-Raw'!CF:CF,\"NA\")","v":0},{"$f":"COUNTIF('July-Raw'!CH:CH,\"NA\")","v":0}]
["Blanks",{"$f":"B8-(SUM(B3:B6))","v":0},{"$f":"C8-(SUM(C3:C6))","v":0},0,0,0,0,0,0,0,0,0,5,5,5,5,5,5,5,5,5,5,5,5,5,5,5,5,5,5,5,5,5,5,5,5,5,5,5,5,5]
["full sample size",{"$f":"COUNTA('July-Raw'!A:A)-2","v":5},{"$f":"B8","v":5},5,5,5,5,5,5,5,5,5,5,5,5,5,5,5,5,5,5,5,5,5,5,5,5,5,5,5,5,5,5,5,5,5,5,5,5,5,5]
["True sample size (-NA + blanks)",{"$f":"IF(ISERROR(B8-(B6+B7)),\"\",B8-(B6+B7))","v":5},{"$f":"IF(ISERROR(C8-(C6+C7)),\"\",C8-(C6+C7))","v":5},5,5,5,5,5,5,5,5,5,0,0,0,0,0,0,0,0,0,0,0,0,0,0,0,0,0,0,0,0,0,0,0,0,0,0,0,0,0]
["%Y",{"$f":"IF(ISERROR(B3/B9),\"\",B3/B9)","v":1},{"$f":"IF(ISERROR(C3/C9),\"\",C3/C9)","v":1},0.8,1,1,1,0.8,1,1,1,1,"","","","","","","","","","","","","","","","","","","","","","","","","","","","",""]
["%N",{"$f":"IF(ISERROR(B4/B9),\"\",B4/B9)","v":0},{"$f":"IF(ISERROR(C4/C9),\"\",C4/C9)","v":0},0.2,0,0,0,0,0,0,0,0,"","","","","","","","","","","","","","","","","","","","","","","","","","","","",""]
["%N - Justified",{"$f":"IF(ISERROR(B5/B9),\"\",B5/B9)","v":0},{"$f":"IF(ISERROR(C5/C9),\"\",C5/C9)","v":0},0,0,0,0,0.2,0,0,0,0,"","","","","","","","","","","","","","","","","","","","","","","","","","","","",""]

{"sheet":"Aug","index":18,"n_rows":51,"n_cols":8,"rows_kept":51,"cut":false,"hidden":false,"merged":[]}
["Click here to go to year overview"]
[]
["Date",null,null,"Total by Apt type"]
["Completed by",null,null,"New",{"$f":"COUNTIF('Aug-Raw'!E3:E103,\"New\")","v":5}]
["Sample group size",{"$f":"COUNTA('Aug-Raw'!A:A)-2","v":5},null,"Follow up",{"$f":"COUNTIF('Aug-Raw'!E3:E103,\"Fup\")","v":0},null,null,{"$f":"Year!H5","v":0.95}]
["Overall Result (compliant only)",{"$f":"IF(ISERROR(SUM(D11:D50)/G51),\"\",SUM(D11:D50)/G51)","v":0.96363636363636362},null,"Total by apt Code",null,null,null,{"$f":"Year!H6","v":"80-95%"}]
["Overall Result (compliant & Justified)",{"$f":"IF(ISERROR(SUM(C11:C50)/G51),\"\",SUM(C11:C50)/G51)","v":0.98181818181818192},null,"code goes in here",{"$f":"COUNTIF('Aug-Raw'!F3:F103,D7)","v":0},null,null,{"$f":"Year!H7","v":0.8}]
["viable qs",{"$f":"G51","v":11}]
[]
["Metric","Target %","Compliant + Justified","Compliant","Justified","Not compliant","Irritating math"]
[{"$f":"IF(ISERROR(Q!A2),\"\",Q!A2)","v":"Was a Room number documented?"},{"$f":"IF(ISERROR(Q!B2),\"\",Q!B2)","v":0},{"$f":"IF(ISERROR(D11+E11),\"\",D11+E11)","v":1},{"$f":"'Aug-Data'!B10","v":1},{"$f":"'Aug-Data'!B12","v":0},{"$f":"'Aug-Data'!B11","v":0},{"$f":"COUNTIF(D11:F11,\">0\")","v":1}]
[{"$f":"IF(ISERROR(Q!A3),\"\",Q!A3)","v":"Were stage A checks completed as appropriate?"},{"$f":"IF(ISERROR(Q!B3),\"\",Q!B3)","v":0},0.8,{"$f":"'Aug-Data'!C10","v":0.8},{"$f":"'Aug-Data'!C12","v":0},{"$f":"'Aug-Data'!C11","v":0.2},2]
[{"$f":"IF(ISERROR(Q!A4),\"\",Q!A4)","v":"Was COSI Part 1 performed?"},{"$f":"IF(ISERROR(Q!B4),\"\",Q!B4)","v":0},1,{"$f":"'Aug-Data'!D10","v":1},{"$f":"'Aug-Data'!D12","v":0},{"$f":"'Aug-Data'!D11","v":0},1]
[{"$f":"IF(ISERROR(Q!A5),\"\",Q!A5)","v":"Was PVP documented?"},{"$f":"IF(ISERROR(Q!B5),\"\",Q!B5)","v":0},1,{"$f":"'Aug-Data'!E10","v":1},{"$f":"'Aug-Data'!E12","v":0},{"$f":"'Aug-Data'!E11","v":0},1]
[{"$f":"IF(ISERROR(Q!A6),\"\",Q!A6)","v":"Was Otoscopy documented?"},{"$f":"IF(ISERROR(Q!B6),\"\",Q!B6)","v":0},1,{"$f":"'Aug-Data'!F10","v":1},{"$f":"'Aug-Data'!F12","v":0},{"$f":"'Aug-Data'!F11","v":0},1]
[{"$f":"IF(ISERROR(Q!A7),\"\",Q!A7)","v":"Document bc at 3 & 4kHz is for programming purposes?"},{"$f":"IF(ISERROR(Q!B7),\"\",Q!B7)","v":0},1,{"$f":"'Aug-Data'!G10","v":1},{"$f":"'Aug-Data'!G12","v":0},{"$f":"'Aug-Data'!G11","v":0},1]
[{"$f":"IF(ISERROR(Q!A8),\"\",Q!A8)","v":"Was Speech testing performed?"},{"$f":"IF(ISERROR(Q!B8),\"\",Q!B8)","v":0},1,{"$f":"'Aug-Data'!H10","v":1},{"$f":"'Aug-Data'!H12","v":0},{"$f":"'Aug-Data'!H11","v":0},1]
[{"$f":"IF(ISERROR(Q!A9),\"\",Q!A9)","v":"Is it documented whether national criteria were/were not met?"},{"$f":"IF(ISERROR(Q!B9),\"\",Q!B9)","v":0},1,{"$f":"'Aug-Data'!I10","v":1},{"$f":"'Aug-Data'!I12","v":0},{"$f":"'Aug-Data'!I11","v":0},1]
[{"$f":"IF(ISERROR(Q!A10),\"\",Q!A10)","v":"Was a BCHI info pack supplied?"},{"$f":"IF(ISERROR(Q!B10),\"\",Q!B10)","v":0},1,{"$f":"'Aug-Data'!J10","v":0.8},{"$f":"'Aug-Data'!J12","v":0.2},{"$f":"'Aug-Data'!J11","v":0},2]
[{"$f":"IF(ISERROR(Q!A11),\"\",Q!A11)","v":"Was the report authorised & issued within target (7 days)?"},{"$f":"IF(ISERROR(Q!B11),\"\",Q!B11)","v":0},1,{"$f":"'Aug-Data'!K10","v":1},{"$f":"'Aug-Data'!K12","v":0},{"$f":"'Aug-Data'!K11","v":0},1]
[{"$f":"IF(ISERROR(Q!A12),\"\",Q!A12)","v":"Was consent documented as appropriate?"},{"$f":"IF(ISERROR(Q!B12),\"\",Q!B12)","v":0},1,{"$f":"'Aug-Data'!L10","v":1},{"$f":"'Aug-Data'!L12","v":0},{"$f":"'Aug-Data'!L11","v":0},1]
[{"$f":"IF(ISERROR(Q!A13),\"\",Q!A13)","v":0},{"$f":"IF(ISERROR(Q!B13),\"\",Q!B13)","v":0},"",{"$f":"'Aug-Data'!M10","v":""},{"$f":"'Aug-Data'!M12","v":""},{"$f":"'Aug-Data'!M11","v":""},0]
[{"$f":"IF(ISERROR(Q!A14),\"\",Q!A14)","v":0},{"$f":"IF(ISERROR(Q!B14),\"\",Q!B14)","v":0},"",{"$f":"'Aug-Data'!N10","v":""},{"$f":"'Aug-Data'!N12","v":""},{"$f":"'Aug-Data'!N11","v":""},0]
[{"$f":"IF(ISERROR(Q!A15),\"\",Q!A15)","v":0},{"$f":"IF(ISERROR(Q!B15),\"\",Q!B15)","v":0},"",{"$f":"'Aug-Data'!O10","v":""},{"$f":"'Aug-Data'!O12","v":""},{"$f":"'Aug-Data'!O11","v":""},0]
[{"$f":"IF(ISERROR(Q!A16),\"\",Q!A16)","v":0},{"$f":"IF(ISERROR(Q!B16),\"\",Q!B16)","v":0},"",{"$f":"'Aug-Data'!P10","v":""},{"$f":"'Aug-Data'!P12","v":""},{"$f":"'Aug-Data'!P11","v":""},0]
[{"$f":"IF(ISERROR(Q!A17),\"\",Q!A17)","v":0},{"$f":"IF(ISERROR(Q!B17),\"\",Q!B17)","v":0},"",{"$f":"'Aug-Data'!Q10","v":""},{"$f":"'Aug-Data'!Q12","v":""},{"$f":"'Aug-Data'!Q11","v":""},0]
[{"$f":"IF(ISERROR(Q!A18),\"\",Q!A18)","v":0},{"$f":"IF(ISERROR(Q!B18),\"\",Q!B18)","v":0},"",{"$f":"'Aug-Data'!R10","v":""},{"$f":"'Aug-Data'!R12","v":""},{"$f":"'Aug-Data'!R11","v":""},0]
[{"$f":"IF(ISERROR(Q!A19),\"\",Q!A19)","v":0},{"$f":"IF(ISERROR(Q!B19),\"\",Q!B19)","v":0},"",{"$f":"'Aug-Data'!S10","v":""},{"$f":"'Aug-Data'!S12","v":""},{"$f":"'Aug-Data'!S11","v":""},0]
[{"$f":"IF(ISERROR(Q!A20),\"\",Q!A20)","v":0},{"$f":"IF(ISERROR(Q!B20),\"\",Q!B20)","v":0},"",{"$f":"'Aug-Data'!T10","v":""},{"$f":"'Aug-Data'!T12","v":""},{"$f":"'Aug-Data'!T11","v":""},0]
[{"$f":"IF(ISERROR(Q!A21),\"\",Q!A21)","v":0},{"$f":"IF(ISERROR(Q!B21),\"\",Q!B21)","v":0},"",{"$f":"'Aug-Data'!U10","v":""},{"$f":"'Aug-Data'!U12","v":""},{"$f":"'Aug-Data'!U11","v":""},0]
[{"$f":"IF(ISERROR(Q!A22),\"\",Q!A22)","v":0},{"$f":"IF(ISERROR(Q!B22),\"\",Q!B22)","v":0},"",{"$f":"'Aug-Data'!V10","v":""},{"$f":"'Aug-Data'!V12","v":""},{"$f":"'Aug-Data'!V11","v":""},0]
[{"$f":"IF(ISERROR(Q!A23),\"\",Q!A23)","v":0},{"$f":"IF(ISERROR(Q!B23),\"\",Q!B23)","v":0},"",{"$f":"'Aug-Data'!W10","v":""},{"$f":"'Aug-Data'!W12","v":""},{"$f":"'Aug-Data'!W11","v":""},0]
[{"$f":"IF(ISERROR(Q!A24),\"\",Q!A24)","v":0},{"$f":"IF(ISERROR(Q!B24),\"\",Q!B24)","v":0},"",{"$f":"'Aug-Data'!X10","v":""},{"$f":"'Aug-Data'!X12","v":""},{"$f":"'Aug-Data'!X11","v":""},0]
[{"$f":"IF(ISERROR(Q!A25),\"\",Q!A25)","v":0},{"$f":"IF(ISERROR(Q!B25),\"\",Q!B25)","v":0},"",{"$f":"'Aug-Data'!Y10","v":""},{"$f":"'Aug-Data'!Y12","v":""},{"$f":"'Aug-Data'!Y11","v":""},0]
[{"$f":"IF(ISERROR(Q!A26),\"\",Q!A26)","v":0},{"$f":"IF(ISERROR(Q!B26),\"\",Q!B26)","v":0},"",{"$f":"'Aug-Data'!Z10","v":""},{"$f":"'Aug-Data'!Z12","v":""},{"$f":"'Aug-Data'!Z11","v":""},0]
[{"$f":"IF(ISERROR(Q!A27),\"\",Q!A27)","v":0},{"$f":"IF(ISERROR(Q!B27),\"\",Q!B27)","v":0},"",{"$f":"'Aug-Data'!AA10","v":""},{"$f":"'Aug-Data'!AA12","v":""},{"$f":"'Aug-Data'!AA11","v":""},0]
[{"$f":"IF(ISERROR(Q!A28),\"\",Q!A28)","v":0},{"$f":"IF(ISERROR(Q!B28),\"\",Q!B28)","v":0},"",{"$f":"'Aug-Data'!AB10","v":""},{"$f":"'Aug-Data'!AB12","v":""},{"$f":"'Aug-Data'!AB11","v":""},0]
[{"$f":"IF(ISERROR(Q!A29),\"\",Q!A29)","v":0},{"$f":"IF(ISERROR(Q!B29),\"\",Q!B29)","v":0},"",{"$f":"'Aug-Data'!AC10","v":""},{"$f":"'Aug-Data'!AC12","v":""},{"$f":"'Aug-Data'!AC11","v":""},0]
[{"$f":"IF(ISERROR(Q!A30),\"\",Q!A30)","v":0},{"$f":"IF(ISERROR(Q!B30),\"\",Q!B30)","v":0},"",{"$f":"'Aug-Data'!AD10","v":""},{"$f":"'Aug-Data'!AD12","v":""},{"$f":"'Aug-Data'!AD11","v":""},0]
[{"$f":"IF(ISERROR(Q!A31),\"\",Q!A31)","v":0},{"$f":"IF(ISERROR(Q!B31),\"\",Q!B31)","v":0},"",{"$f":"'Aug-Data'!AE10","v":""},{"$f":"'Aug-Data'!AE12","v":""},{"$f":"'Aug-Data'!AE11","v":""},0]
[{"$f":"IF(ISERROR(Q!A32),\"\",Q!A32)","v":0},{"$f":"IF(ISERROR(Q!B32),\"\",Q!B32)","v":0},"",{"$f":"'Aug-Data'!AF10","v":""},{"$f":"'Aug-Data'!AF12","v":""},{"$f":"'Aug-Data'!AF11","v":""},0]
[{"$f":"IF(ISERROR(Q!A33),\"\",Q!A33)","v":0},{"$f":"IF(ISERROR(Q!B33),\"\",Q!B33)","v":0},"",{"$f":"'Aug-Data'!AG10","v":""},{"$f":"'Aug-Data'!AG12","v":""},{"$f":"'Aug-Data'!AG11","v":""},0]
[{"$f":"IF(ISERROR(Q!A34),\"\",Q!A34)","v":0},{"$f":"IF(ISERROR(Q!B34),\"\",Q!B34)","v":0},"",{"$f":"'Aug-Data'!AH10","v":""},{"$f":"'Aug-Data'!AH12","v":""},{"$f":"'Aug-Data'!AH11","v":""},0]
[{"$f":"IF(ISERROR(Q!A35),\"\",Q!A35)","v":0},{"$f":"IF(ISERROR(Q!B35),\"\",Q!B35)","v":0},"",{"$f":"'Aug-Data'!AI10","v":""},{"$f":"'Aug-Data'!AI12","v":""},{"$f":"'Aug-Data'!AI11","v":""},0]
[{"$f":"IF(ISERROR(Q!A36),\"\",Q!A36)","v":0},{"$f":"IF(ISERROR(Q!B36),\"\",Q!B36)","v":0},"",{"$f":"'Aug-Data'!AJ10","v":""},{"$f":"'Aug-Data'!AJ12","v":""},{"$f":"'Aug-Data'!AJ11","v":""},0]
[{"$f":"IF(ISERROR(Q!A37),\"\",Q!A37)","v":0},{"$f":"IF(ISERROR(Q!B37),\"\",Q!B37)","v":0},"",{"$f":"'Aug-Data'!AK10","v":""},{"$f":"'Aug-Data'!AK12","v":""},{"$f":"'Aug-Data'!AK11","v":""},0]
[{"$f":"IF(ISERROR(Q!A38),\"\",Q!A38)","v":0},{"$f":"IF(ISERROR(Q!B38),\"\",Q!B38)","v":0},"",{"$f":"'Aug-Data'!AL10","v":""},{"$f":"'Aug-Data'!AL12","v":""},{"$f":"'Aug-Data'!AL11","v":""},0]
[{"$f":"IF(ISERROR(Q!A39),\"\",Q!A39)","v":0},{"$f":"IF(ISERROR(Q!B39),\"\",Q!B39)","v":0},"",{"$f":"'Aug-Data'!AM10","v":""},{"$f":"'Aug-Data'!AM12","v":""},{"$f":"'Aug-Data'!AM11","v":""},0]
[{"$f":"IF(ISERROR(Q!A40),\"\",Q!A40)","v":0},{"$f":"IF(ISERROR(Q!B40),\"\",Q!B40)","v":0},"",{"$f":"'Aug-Data'!AN10","v":""},{"$f":"'Aug-Data'!AN12","v":""},{"$f":"'Aug-Data'!AN11","v":""},0]
[{"$f":"IF(ISERROR(Q!A41),\"\",Q!A41)","v":0},{"$f":"IF(ISERROR(Q!B41),\"\",Q!B41)","v":0},"",{"$f":"'Aug-Data'!AO10","v":""},{"$f":"'Aug-Data'!AO12","v":""},{"$f":"'Aug-Data'!AO11","v":""},0]
[null,null,null,null,null,null,{"$f":"COUNTIF(G11:G50,\">=1\")","v":11}]

{"sheet":"Aug-Raw","index":19,"n_rows":7,"n_cols":87,"rows_kept":7,"cut":false,"hidden":true,"merged":[[0,85,0,86],[0,63,0,64],[0,65,0,66],[0,67,0,68],[0,69,0,70],[0,71,0,72],[0,73,0,74],[0,75,0,76],[0,77,0,78],[0,79,0,80],[0,81,0,82],[0,83,0,84],[0,61,0,62],[0,39,0,40],[0,41,0,42],[0,43,0,44],[0,45,0,46],[0,47,0,48],[0,49,0,50],[0,51,0,52],[0,53,0,54],[0,55,0,56],[0,57,0,58],[0,59,0,60],[0,37,0,38],[0,15,0,16],[0,17,0,18],[0,19,0,20],[0,21,0,22],[0,23,0,24],[0,25,0,26],[0,27,0,28],[0,29,0,30],[0,31,0,32],[0,33,0,34],[0,35,0,36],[0,13,0,14],[0,0,0,5],[0,6,1,6],[0,7,0,8],[0,9,0,10],[0,11,0,12]]}
["Record details",null,null,null,null,null,"Notes",{"$f":"Q!A2","v":"Was a Room number documented?"},null,{"$f":"Q!A3","v":"Were stage A checks completed as appropriate?"},null,{"$f":"Q!A4","v":"Was COSI Part 1 performed?"},null,{"$f":"Q!A5","v":"Was PVP documented?"},null,{"$f":"Q!A6","v":"Was Otoscopy documented?"},null,{"$f":"Q!A7","v":"Document bc at 3 & 4kHz is for programming purposes?"},null,{"$f":"Q!A8","v":"Was Speech testing performed?"},null,{"$f":"Q!A9","v":"Is it documented whether national criteria were/were not met?"},null,{"$f":"Q!A10","v":"Was a BCHI info pack supplied?"},null,{"$f":"Q!A11","v":"Was the report authorised & issued within target (7 days)?"},null,{"$f":"Q!A12","v":"Was consent documented as appropriate?"},null,{"$f":"Q!A13","v":0},null,{"$f":"Q!A14","v":0},null,{"$f":"Q!A15","v":0},null,{"$f":"Q!A16","v":0},null,{"$f":"Q!A17","v":0},null,{"$f":"Q!A18","v":0},null,{"$f":"Q!A19","v":0},null,{"$f":"Q!A20","v":0},null,{"$f":"Q!A21","v":0},null,{"$f":"Q!A22","v":0},null,{"$f":"Q!A23","v":0},null,{"$f":"Q!A24","v":0},null,{"$f":"Q!A25","v":0},null,{"$f":"Q!A26","v":0},null,{"$f":"Q!A27","v":0},null,{"$f":"Q!A28","v":0},null,{"$f":"Q!A29","v":0},null,{"$f":"Q!A30","v":0},null,{"$f":"Q!A31","v":0},null,{"$f":"Q!A32","v":0},null,{"$f":"Q!A33","v":0},null,{"$f":"Q!A34","v":0},null,{"$f":"Q!A35","v":0},null,{"$f":"Q!A36","v":0},null,{"$f":"Q!A37","v":0},null,{"$f":"Q!A38","v":0},null,{"$f":"Q!A39","v":0},null,{"$f":"Q!A40","v":0},null,{"$f":"Q!A41","v":0}]
["Pt number","Date seen","Clinician 1","clinician 2","New/ F-up","Apt code",null,"Compliant?","Other result","Compliant?","Other result","Compliant?","Other result","Compliant?","Other result","Compliant?","Other result","Compliant?","Other result","Compliant?","Other result","Compliant?","Other result","Compliant?","Other result","Compliant?","Other result","Compliant?","Other result","Compliant?","Other result","Compliant?","Other result","Compliant?","Other result","Compliant?","Other result","Compliant?","Other result","Compliant?","Other result","Compliant?","Other result","Compliant?","Other result","Compliant?","Other result","Compliant?","Other result","Compliant?","Other result","Compliant?","Other result","Compliant?","Other result","Compliant?","Other result","Compliant?","Other result","Compliant?","Other result","Compliant?","Other result","Compliant?","Other result","Compliant?","Other result","Compliant?","Other result","Compliant?","Other result","Compliant?","Other result","Compliant?","Other result","Compliant?","Other result","Compliant?","Other result","Compliant?","Other result","Compliant?","Other result","Compliant?","Other result","Compliant?","Other result"]
["AB0001","2023-08-08","AA",null,"New","BA",null,"Yes",null,"Yes",null,"Yes",null,"Yes",null,"Yes",null,"Yes",null,"Yes",null,"Yes",null,"Yes",null,"Yes",null,"Yes"]
["AB0002","2023-08-17","AA",null,"New","BA",null,"Yes",null,"No",null,"Yes",null,"Yes",null,"Yes",null,"Yes",null,"Yes",null,"Yes",null,"Yes",null,"Yes",null,"Yes"]
["AB0003","2023-08-24","BB",null,"New","BA",null,"Yes",null,"Yes",null,"Yes",null,"Yes",null,"Yes",null,"Yes",null,"Yes",null,"Yes",null,"Yes",null,"Yes",null,"Yes"]
["AB0004","2023-08-26","BB",null,"New","BA",null,"Yes",null,"Yes",null,"Yes",null,"Yes",null,"Yes",null,"Yes",null,"Yes",null,"Yes",null,"Yes",null,"Yes",null,"Yes"]
["AB0005","2023-08-28","CC",null,"New","BA",null,"Yes",null,"Yes",null,"Yes",null,"Yes",null,"Yes",null,"Yes",null,"Yes",null,"Yes",null,"Justified","Not proceeding with BCHI","Yes",null,"Yes"]

{"sheet":"Aug-Data","index":20,"n_rows":12,"n_cols":41,"rows_kept":12,"cut":false,"hidden":true,"merged":[[0,0,1,0]]}
["Results",{"$f":"Q!A2","v":"Was a Room number documented?"},{"$f":"Q!A3","v":"Were stage A checks completed as appropriate?"},{"$f":"Q!A4","v":"Was COSI Part 1 performed?"},{"$f":"Q!A5","v":"Was PVP documented?"},{"$f":"Q!A6","v":"Was Otoscopy documented?"},{"$f":"Q!A7","v":"Document bc at 3 & 4kHz is for programming purposes?"},{"$f":"Q!A8","v":"Was Speech testing performed?"},{"$f":"Q!A9","v":"Is it documented whether national criteria were/were not met?"},{"$f":"Q!A10","v":"Was a BCHI info pack supplied?"},{"$f":"Q!A11","v":"Was the report authorised & issued within target (7 days)?"},{"$f":"Q!A12","v":"Was consent documented as appropriate?"},{"$f":"Q!A13","v":0},{"$f":"Q!A14","v":0},{"$f":"Q!A15","v":0},{"$f":"Q!A16","v":0},{"$f":"Q!A17","v":0},{"$f":"Q!A18","v":0},{"$f":"Q!A19","v":0},{"$f":"Q!A20","v":0},{"$f":"Q!A21","v":0},{"$f":"Q!A22","v":0},{"$f":"Q!A23","v":0},{"$f":"Q!A24","v":0},{"$f":"Q!A25","v":0},{"$f":"Q!A26","v":0},{"$f":"Q!A27","v":0},{"$f":"Q!A28","v":0},{"$f":"Q!A29","v":0},{"$f":"Q!A30","v":0},{"$f":"Q!A31","v":0},{"$f":"Q!A32","v":0},{"$f":"Q!A33","v":0},{"$f":"Q!A34","v":0},{"$f":"Q!A35","v":0},{"$f":"Q!A36","v":0},{"$f":"Q!A37","v":0},{"$f":"Q!A38","v":0},{"$f":"Q!A39","v":0},{"$f":"Q!A40","v":0},{"$f":"Q!A41","v":0}]
[null,"Compliant?","Compliant?","Compliant?","Compliant?","Compliant?","Compliant?","Compliant?","Compliant?","Compliant?","Compliant?","Compliant?","Compliant?","Compliant?","Compliant?","Compliant?","Compliant?","Compliant?","Compliant?","Compliant?","Compliant?","Compliant?","Compliant?","Compliant?","Compliant?","Compliant?","Compliant?","Compliant?","Compliant?","Compliant?","Compliant?","Compliant?","Compliant?","Compliant?","Compliant?","Compliant?","Compliant?","Compliant?","Compliant?","Compliant?","Compliant?"]
["Total Y",{"$f":"COUNTIF('Aug-Raw'!H:H,\"yes\")","v":5},{"$f":"COUNTIF('Aug-Raw'!J:J,\"yes\")","v":4},{"$f":"COUNTIF('Aug-Raw'!L:L,\"yes\")","v":5},{"$f":"COUNTIF('Aug-Raw'!N:N,\"yes\")","v":5},{"$f":"COUNTIF('Aug-Raw'!P:P,\"yes\")","v":5},{"$f":"COUNTIF('Aug-Raw'!R:R,\"yes\")","v":5},{"$f":"COUNTIF('Aug-Raw'!T:T,\"yes\")","v":5},{"$f":"COUNTIF('Aug-Raw'!V:V,\"yes\")","v":5},{"$f":"COUNTIF('Aug-Raw'!X:X,\"yes\")","v":4},{"$f":"COUNTIF('Aug-Raw'!Z:Z,\"yes\")","v":5},{"$f":"COUNTIF('Aug-Raw'!AB:AB,\"yes\")","v":5},{"$f":"COUNTIF('Aug-Raw'!AD:AD,\"yes\")","v":0},{"$f":"COUNTIF('Aug-Raw'!AF:AF,\"yes\")","v":0},{"$f":"COUNTIF('Aug-Raw'!AH:AH,\"yes\")","v":0},{"$f":"COUNTIF('Aug-Raw'!AJ:AJ,\"yes\")","v":0},{"$f":"COUNTIF('Aug-Raw'!AL:AL,\"yes\")","v":0},{"$f":"COUNTIF('Aug-Raw'!AN:AN,\"yes\")","v":0},{"$f":"COUNTIF('Aug-Raw'!AP:AP,\"yes\")","v":0},{"$f":"COUNTIF('Aug-Raw'!AR:AR,\"yes\")","v":0},{"$f":"COUNTIF('Aug-Raw'!AT:AT,\"yes\")","v":0},{"$f":"COUNTIF('Aug-Raw'!AV:AV,\"yes\")","v":0},{"$f":"COUNTIF('Aug-Raw'!AX:AX,\"yes\")","v":0},{"$f":"COUNTIF('Aug-Raw'!AZ:AZ,\"yes\")","v":0},{"$f":"COUNTIF('Aug-Raw'!BB:BB,\"yes\")","v":0},{"$f":"COUNTIF('Aug-Raw'!BD:BD,\"yes\")","v":0},{"$f":"COUNTIF('Aug-Raw'!BF:BF,\"yes\")","v":0},{"$f":"COUNTIF('Aug-Raw'!BH:BH,\"yes\")","v":0},{"$f":"COUNTIF('Aug-Raw'!BJ:BJ,\"yes\")","v":0},{"$f":"COUNTIF('Aug-Raw'!BL:BL,\"yes\")","v":0},{"$f":"COUNTIF('Aug-Raw'!BN:BN,\"yes\")","v":0},{"$f":"COUNTIF('Aug-Raw'!BP:BP,\"yes\")","v":0},{"$f":"COUNTIF('Aug-Raw'!BR:BR,\"yes\")","v":0},{"$f":"COUNTIF('Aug-Raw'!BT:BT,\"yes\")","v":0},{"$f":"COUNTIF('Aug-Raw'!BV:BV,\"yes\")","v":0},{"$f":"COUNTIF('Aug-Raw'!BX:BX,\"yes\")","v":0},{"$f":"COUNTIF('Aug-Raw'!BZ:BZ,\"yes\")","v":0},{"$f":"COUNTIF('Aug-Raw'!CB:CB,\"yes\")","v":0},{"$f":"COUNTIF('Aug-Raw'!CD:CD,\"yes\")","v":0},{"$f":"COUNTIF('Aug-Raw'!CF:CF,\"yes\")","v":0},{"$f":"COUNTIF('Aug-Raw'!CH:CH,\"yes\")","v":0}]
["Total N",{"$f":"COUNTIF('Aug-Raw'!H:H,\"no\")","v":0},{"$f":"COUNTIF('Aug-Raw'!J:J,\"no\")","v":1},{"$f":"COUNTIF('Aug-Raw'!L:L,\"no\")","v":0},{"$f":"COUNTIF('Aug-Raw'!N:N,\"no\")","v":0},{"$f":"COUNTIF('Aug-Raw'!P:P,\"no\")","v":0},{"$f":"COUNTIF('Aug-Raw'!R:R,\"no\")","v":0},{"$f":"COUNTIF('Aug-Raw'!T:T,\"no\")","v":0},{"$f":"COUNTIF('Aug-Raw'!V:V,\"no\")","v":0},{"$f":"COUNTIF('Aug-Raw'!X:X,\"no\")","v":0},{"$f":"COUNTIF('Aug-Raw'!Z:Z,\"no\")","v":0},{"$f":"COUNTIF('Aug-Raw'!AB:AB,\"no\")","v":0},{"$f":"COUNTIF('Aug-Raw'!AD:AD,\"no\")","v":0},{"$f":"COUNTIF('Aug-Raw'!AF:AF,\"no\")","v":0},{"$f":"COUNTIF('Aug-Raw'!AH:AH,\"no\")","v":0},{"$f":"COUNTIF('Aug-Raw'!AJ:AJ,\"no\")","v":0},{"$f":"COUNTIF('Aug-Raw'!AL:AL,\"no\")","v":0},{"$f":"COUNTIF('Aug-Raw'!AN:AN,\"no\")","v":0},{"$f":"COUNTIF('Aug-Raw'!AP:AP,\"no\")","v":0},{"$f":"COUNTIF('Aug-Raw'!AR:AR,\"no\")","v":0},{"$f":"COUNTIF('Aug-Raw'!AT:AT,\"no\")","v":0},{"$f":"COUNTIF('Aug-Raw'!AV:AV,\"no\")","v":0},{"$f":"COUNTIF('Aug-Raw'!AX:AX,\"no\")","v":0},{"$f":"COUNTIF('Aug-Raw'!AZ:AZ,\"no\")","v":0},{"$f":"COUNTIF('Aug-Raw'!BB:BB,\"no\")","v":0},{"$f":"COUNTIF('Aug-Raw'!BD:BD,\"no\")","v":0},{"$f":"COUNTIF('Aug-Raw'!BF:BF,\"no\")","v":0},{"$f":"COUNTIF('Aug-Raw'!BH:BH,\"no\")","v":0},{"$f":"COUNTIF('Aug-Raw'!BJ:BJ,\"no\")","v":0},{"$f":"COUNTIF('Aug-Raw'!BL:BL,\"no\")","v":0},{"$f":"COUNTIF('Aug-Raw'!BN:BN,\"no\")","v":0},{"$f":"COUNTIF('Aug-Raw'!BP:BP,\"no\")","v":0},{"$f":"COUNTIF('Aug-Raw'!BR:BR,\"no\")","v":0},{"$f":"COUNTIF('Aug-Raw'!BT:BT,\"no\")","v":0},{"$f":"COUNTIF('Aug-Raw'!BV:BV,\"no\")","v":0},{"$f":"COUNTIF('Aug-Raw'!BX:BX,\"no\")","v":0},{"$f":"COUNTIF('Aug-Raw'!BZ:BZ,\"no\")","v":0},{"$f":"COUNTIF('Aug-Raw'!CB:CB,\"no\")","v":0},{"$f":"COUNTIF('Aug-Raw'!CD:CD,\"no\")","v":0},{"$f":"COUNTIF('Aug-Raw'!CF:CF,\"no\")","v":0},{"$f":"COUNTIF('Aug-Raw'!CH:CH,\"no\")","v":0}]
["Total Justified",{"$f":"COUNTIF('Aug-Raw'!H:H,\"Justified\")","v":0},{"$f":"COUNTIF('Aug-Raw'!J:J,\"Justified\")","v":0},{"$f":"COUNTIF('Aug-Raw'!L:L,\"Justified\")","v":0},{"$f":"COUNTIF('Aug-Raw'!N:N,\"Justified\")","v":0},{"$f":"COUNTIF('Aug-Raw'!P:P,\"Justified\")","v":0},{"$f":"COUNTIF('Aug-Raw'!R:R,\"Justified\")","v":0},{"$f":"COUNTIF('Aug-Raw'!T:T,\"Justified\")","v":0},{"$f":"COUNTIF('Aug-Raw'!V:V,\"Justified\")","v":0},{"$f":"COUNTIF('Aug-Raw'!X:X,\"Justified\")","v":1},{"$f":"COUNTIF('Aug-Raw'!Z:Z,\"Justified\")","v":0},{"$f":"COUNTIF('Aug-Raw'!AB:AB,\"Justified\")","v":0},{"$f":"COUNTIF('Aug-Raw'!AD:AD,\"Justified\")","v":0},{"$f":"COUNTIF('Aug-Raw'!AF:AF,\"Justified\")","v":0},{"$f":"COUNTIF('Aug-Raw'!AH:AH,\"Justified\")","v":0},{"$f":"COUNTIF('Aug-Raw'!AJ:AJ,\"Justified\")","v":0},{"$f":"COUNTIF('Aug-Raw'!AL:AL,\"Justified\")","v":0},{"$f":"COUNTIF('Aug-Raw'!AN:AN,\"Justified\")","v":0},{"$f":"COUNTIF('Aug-Raw'!AP:AP,\"Justified\")","v":0},{"$f":"COUNTIF('Aug-Raw'!AR:AR,\"Justified\")","v":0},{"$f":"COUNTIF('Aug-Raw'!AT:AT,\"Justified\")","v":0},{"$f":"COUNTIF('Aug-Raw'!AV:AV,\"Justified\")","v":0},{"$f":"COUNTIF('Aug-Raw'!AX:AX,\"Justified\")","v":0},{"$f":"COUNTIF('Aug-Raw'!AZ:AZ,\"Justified\")","v":0},{"$f":"COUNTIF('Aug-Raw'!BB:BB,\"Justified\")","v":0},{"$f":"COUNTIF('Aug-Raw'!BD:BD,\"Justified\")","v":0},{"$f":"COUNTIF('Aug-Raw'!BF:BF,\"Justified\")","v":0},{"$f":"COUNTIF('Aug-Raw'!BH:BH,\"Justified\")","v":0},{"$f":"COUNTIF('Aug-Raw'!BJ:BJ,\"Justified\")","v":0},{"$f":"COUNTIF('Aug-Raw'!BL:BL,\"Justified\")","v":0},{"$f":"COUNTIF('Aug-Raw'!BN:BN,\"Justified\")","v":0},{"$f":"COUNTIF('Aug-Raw'!BP:BP,\"Justified\")","v":0},{"$f":"COUNTIF('Aug-Raw'!BR:BR,\"Justified\")","v":0},{"$f":"COUNTIF('Aug-Raw'!BT:BT,\"Justified\")","v":0},{"$f":"COUNTIF('Aug-Raw'!BV:BV,\"Justified\")","v":0},{"$f":"COUNTIF('Aug-Raw'!BX:BX,\"Justified\")","v":0},{"$f":"COUNTIF('Aug-Raw'!BZ:BZ,\"Justified\")","v":0},{"$f":"COUNTIF('Aug-Raw'!CB:CB,\"Justified\")","v":0},{"$f":"COUNTIF('Aug-Raw'!CD:CD,\"Justified\")","v":0},{"$f":"COUNTIF('Aug-Raw'!CF:CF,\"Justified\")","v":0},{"$f":"COUNTIF('Aug-Raw'!CH:CH,\"Justified\")","v":0}]
["Total NA",{"$f":"COUNTIF('Aug-Raw'!H:H,\"NA\")","v":0},{"$f":"COUNTIF('Aug-Raw'!J:J,\"NA\")","v":0},{"$f":"COUNTIF('Aug-Raw'!L:L,\"NA\")","v":0},{"$f":"COUNTIF('Aug-Raw'!N:N,\"NA\")","v":0},{"$f":"COUNTIF('Aug-Raw'!P:P,\"NA\")","v":0},{"$f":"COUNTIF('Aug-Raw'!R:R,\"NA\")","v":0},{"$f":"COUNTIF('Aug-Raw'!T:T,\"NA\")","v":0},{"$f":"COUNTIF('Aug-Raw'!V:V,\"NA\")","v":0},{"$f":"COUNTIF('Aug-Raw'!X:X,\"NA\")","v":0},{"$f":"COUNTIF('Aug-Raw'!Z:Z,\"NA\")","v":0},{"$f":"COUNTIF('Aug-Raw'!AB:AB,\"NA\")","v":0},{"$f":"COUNTIF('Aug-Raw'!AD:AD,\"NA\")","v":0},{"$f":"COUNTIF('Aug-Raw'!AF:AF,\"NA\")","v":0},{"$f":"COUNTIF('Aug-Raw'!AH:AH,\"NA\")","v":0},{"$f":"COUNTIF('Aug-Raw'!AJ:AJ,\"NA\")","v":0},{"$f":"COUNTIF('Aug-Raw'!AL:AL,\"NA\")","v":0},{"$f":"COUNTIF('Aug-Raw'!AN:AN,\"NA\")","v":0},{"$f":"COUNTIF('Aug-Raw'!AP:AP,\"NA\")","v":0},{"$f":"COUNTIF('Aug-Raw'!AR:AR,\"NA\")","v":0},{"$f":"COUNTIF('Aug-Raw'!AT:AT,\"NA\")","v":0},{"$f":"COUNTIF('Aug-Raw'!AV:AV,\"NA\")","v":0},{"$f":"COUNTIF('Aug-Raw'!AX:AX,\"NA\")","v":0},{"$f":"COUNTIF('Aug-Raw'!AZ:AZ,\"NA\")","v":0},{"$f":"COUNTIF('Aug-Raw'!BB:BB,\"NA\")","v":0},{"$f":"COUNTIF('Aug-Raw'!BD:BD,\"NA\")","v":0},{"$f":"COUNTIF('Aug-Raw'!BF:BF,\"NA\")","v":0},{"$f":"COUNTIF('Aug-Raw'!BH:BH,\"NA\")","v":0},{"$f":"COUNTIF('Aug-Raw'!BJ:BJ,\"NA\")","v":0},{"$f":"COUNTIF('Aug-Raw'!BL:BL,\"NA\")","v":0},{"$f":"COUNTIF('Aug-Raw'!BN:BN,\"NA\")","v":0},{"$f":"COUNTIF('Aug-Raw'!BP:BP,\"NA\")","v":0},{"$f":"COUNTIF('Aug-Raw'!BR:BR,\"NA\")","v":0},{"$f":"COUNTIF('Aug-Raw'!BT:BT,\"NA\")","v":0},{"$f":"COUNTIF('Aug-Raw'!BV:BV,\"NA\")","v":0},{"$f":"COUNTIF('Aug-Raw'!BX:BX,\"NA\")","v":0},{"$f":"COUNTIF('Aug-Raw'!BZ:BZ,\"NA\")","v":0},{"$f":"COUNTIF('Aug-Raw'!CB:CB,\"NA\")","v":0},{"$f":"COUNTIF('Aug-Raw'!CD:CD,\"NA\")","v":0},{"$f":"COUNTIF('Aug-Raw'!CF:CF,\"NA\")","v":0},{"$f":"COUNTIF('Aug-Raw'!CH:CH,\"NA\")","v":0}]
["Blanks",{"$f":"B8-(SUM(B3:B6))","v":0},{"$f":"C8-(SUM(C3:C6))","v":0},0,0,0,0,0,0,0,0,0,5,5,5,5,5,5,5,5,5,5,5,5,5,5,5,5,5,5,5,5,5,5,5,5,5,5,5,5,5]
["full sample size",{"$f":"COUNTA('Aug-Raw'!A:A)-2","v":5},{"$f":"B8","v":5},5,5,5,5,5,5,5,5,5,5,5,5,5,5,5,5,5,5,5,5,5,5,5,5,5,5,5,5,5,5,5,5,5,5,5,5,5,5]
["True sample size (-NA + blanks)",{"$f":"IF(ISERROR(B8-(B6+B7)),\"\",B8-(B6+B7))","v":5},{"$f":"IF(ISERROR(C8-(C6+C7)),\"\",C8-(C6+C7))","v":5},5,5,5,5,5,5,5,5,5,0,0,0,0,0,0,0,0,0,0,0,0,0,0,0,0,0,0,0,0,0,0,0,0,0,0,0,0,0]
["%Y",{"$f":"IF(ISERROR(B3/B9),\"\",B3/B9)","v":1},{"$f":"IF(ISERROR(C3/C9),\"\",C3/C9)","v":0.8},1,1,1,1,1,1,0.8,1,1,"","","","","","","","","","","","","","","","","","","","","","","","","","","","",""]
["%N",{"$f":"IF(ISERROR(B4/B9),\"\",B4/B9)","v":0},{"$f":"IF(ISERROR(C4/C9),\"\",C4/C9)","v":0.2},0,0,0,0,0,0,0,0,0,"","","","","","","","","","","","","","","","","","","","","","","","","","","","",""]
["%N - Justified",{"$f":"IF(ISERROR(B5/B9),\"\",B5/B9)","v":0},{"$f":"IF(ISERROR(C5/C9),\"\",C5/C9)","v":0},0,0,0,0,0,0,0.2,0,0,"","","","","","","","","","","","","","","","","","","","","","","","","","","","",""]

{"sheet":"Sept","index":21,"n_rows":51,"n_cols":8,"rows_kept":51,"cut":false,"hidden":false,"merged":[]}
["Click here to go to year overview"]
[]
["Date",null,null,"Total by Apt type"]
["Completed by",null,null,"New",{"$f":"COUNTIF('Sept-Raw'!E3:E103,\"New\")","v":4}]
["Sample group size",{"$f":"COUNTA('Sept-Raw'!A:A)-2","v":4},null,"Follow up",{"$f":"COUNTIF('Sept-Raw'!E3:E103,\"Fup\")","v":0},null,null,{"$f":"Year!H5","v":0.95}]
["Overall Result (compliant only)",{"$f":"IF(ISERROR(SUM(D11:D50)/G51),\"\",SUM(D11:D50)/G51)","v":0.97727272727272729},null,"Total by apt Code",null,null,null,{"$f":"Year!H6","v":"80-95%"}]
["Overall Result (compliant & Justified)",{"$f":"IF(ISERROR(SUM(C11:C50)/G51),\"\",SUM(C11:C50)/G51)","v":0.97727272727272729},null,"code goes in here",{"$f":"COUNTIF('Sept-Raw'!F3:F103,D7)","v":0},null,null,{"$f":"Year!H7","v":0.8}]
["viable qs",{"$f":"G51","v":11}]
[]
["Metric","Target %","Compliant + Justified","Compliant","Justified","Not compliant","Irritating math"]
[{"$f":"IF(ISERROR(Q!A2),\"\",Q!A2)","v":"Was a Room number documented?"},{"$f":"IF(ISERROR(Q!B2),\"\",Q!B2)","v":0},{"$f":"IF(ISERROR(D11+E11),\"\",D11+E11)","v":1},{"$f":"'Sept-Data'!B10","v":1},{"$f":"'Sept-Data'!B12","v":0},{"$f":"'Sept-Data'!B11","v":0},{"$f":"COUNTIF(D11:F11,\">0\")","v":1}]
[{"$f":"IF(ISERROR(Q!A3),\"\",Q!A3)","v":"Were stage A checks completed as appropriate?"},{"$f":"IF(ISERROR(Q!B3),\"\",Q!B3)","v":0},1,{"$f":"'Sept-Data'!C10","v":1},{"$f":"'Sept-Data'!C12","v":0},{"$f":"'Sept-Data'!C11","v":0},1]
[{"$f":"IF(ISERROR(Q!A4),\"\",Q!A4)","v":"Was COSI Part 1 performed?"},{"$f":"IF(ISERROR(Q!B4),\"\",Q!B4)","v":0},0.75,{"$f":"'Sept-Data'!D10","v":0.75},{"$f":"'Sept-Data'!D12","v":0},{"$f":"'Sept-Data'!D11","v":0.25},2]
[{"$f":"IF(ISERROR(Q!A5),\"\",Q!A5)","v":"Was PVP documented?"},{"$f":"IF(ISERROR(Q!B5),\"\",Q!B5)","v":0},1,{"$f":"'Sept-Data'!E10","v":1},{"$f":"'Sept-Data'!E12","v":0},{"$f":"'Sept-Data'!E11","v":0},1]
[{"$f":"IF(ISERROR(Q!A6),\"\",Q!A6)","v":"Was Otoscopy documented?"},{"$f":"IF(ISERROR(Q!B6),\"\",Q!B6)","v":0},1,{"$f":"'Sept-Data'!F10","v":1},{"$f":"'Sept-Data'!F12","v":0},{"$f":"'Sept-Data'!F11","v":0},1]
[{"$f":"IF(ISERROR(Q!A7),\"\",Q!A7)","v":"Document bc at 3 & 4kHz is for programming purposes?"},{"$f":"IF(ISERROR(Q!B7),\"\",Q!B7)","v":0},1,{"$f":"'Sept-Data'!G10","v":1},{"$f":"'Sept-Data'!G12","v":0},{"$f":"'Sept-Data'!G11","v":0},1]
[{"$f":"IF(ISERROR(Q!A8),\"\",Q!A8)","v":"Was Speech testing performed?"},{"$f":"IF(ISERROR(Q!B8),\"\",Q!B8)","v":0},1,{"$f":"'Sept-Data'!H10","v":1},{"$f":"'Sept-Data'!H12","v":0},{"$f":"'Sept-Data'!H11","v":0},1]
[{"$f":"IF(ISERROR(Q!A9),\"\",Q!A9)","v":"Is it documented whether national criteria were/were not met?"},{"$f":"IF(ISERROR(Q!B9),\"\",Q!B9)","v":0},1,{"$f":"'Sept-Data'!I10","v":1},{"$f":"'Sept-Data'!I12","v":0},{"$f":"'Sept-Data'!I11","v":0},1]
[{"$f":"IF(ISERROR(Q!A10),\"\",Q!A10)","v":"Was a BCHI info pack supplied?"},{"$f":"IF(ISERROR(Q!B10),\"\",Q!B10)","v":0},1,{"$f":"'Sept-Data'!J10","v":1},{"$f":"'Sept-Data'!J12","v":0},{"$f":"'Sept-Data'!J11","v":0},1]
[{"$f":"IF(ISERROR(Q!A11),\"\",Q!A11)","v":"Was the report authorised & issued within target (7 days)?"},{"$f":"IF(ISERROR(Q!B11),\"\",Q!B11)","v":0},1,{"$f":"'Sept-Data'!K10","v":1},{"$f":"'Sept-Data'!K12","v":0},{"$f":"'Sept-Data'!K11","v":0},1]
[{"$f":"IF(ISERROR(Q!A12),\"\",Q!A12)","v":"Was consent documented as appropriate?"},{"$f":"IF(ISERROR(Q!B12),\"\",Q!B12)","v":0},1,{"$f":"'Sept-Data'!L10","v":1},{"$f":"'Sept-Data'!L12","v":0},{"$f":"'Sept-Data'!L11","v":0},1]
[{"$f":"IF(ISERROR(Q!A13),\"\",Q!A13)","v":0},{"$f":"IF(ISERROR(Q!B13),\"\",Q!B13)","v":0},"",{"$f":"'Sept-Data'!M10","v":""},{"$f":"'Sept-Data'!M12","v":""},{"$f":"'Sept-Data'!M11","v":""},0]
[{"$f":"IF(ISERROR(Q!A14),\"\",Q!A14)","v":0},{"$f":"IF(ISERROR(Q!B14),\"\",Q!B14)","v":0},"",{"$f":"'Sept-Data'!N10","v":""},{"$f":"'Sept-Data'!N12","v":""},{"$f":"'Sept-Data'!N11","v":""},0]
[{"$f":"IF(ISERROR(Q!A15),\"\",Q!A15)","v":0},{"$f":"IF(ISERROR(Q!B15),\"\",Q!B15)","v":0},"",{"$f":"'Sept-Data'!O10","v":""},{"$f":"'Sept-Data'!O12","v":""},{"$f":"'Sept-Data'!O11","v":""},0]
[{"$f":"IF(ISERROR(Q!A16),\"\",Q!A16)","v":0},{"$f":"IF(ISERROR(Q!B16),\"\",Q!B16)","v":0},"",{"$f":"'Sept-Data'!P10","v":""},{"$f":"'Sept-Data'!P12","v":""},{"$f":"'Sept-Data'!P11","v":""},0]
[{"$f":"IF(ISERROR(Q!A17),\"\",Q!A17)","v":0},{"$f":"IF(ISERROR(Q!B17),\"\",Q!B17)","v":0},"",{"$f":"'Sept-Data'!Q10","v":""},{"$f":"'Sept-Data'!Q12","v":""},{"$f":"'Sept-Data'!Q11","v":""},0]
[{"$f":"IF(ISERROR(Q!A18),\"\",Q!A18)","v":0},{"$f":"IF(ISERROR(Q!B18),\"\",Q!B18)","v":0},"",{"$f":"'Sept-Data'!R10","v":""},{"$f":"'Sept-Data'!R12","v":""},{"$f":"'Sept-Data'!R11","v":""},0]
[{"$f":"IF(ISERROR(Q!A19),\"\",Q!A19)","v":0},{"$f":"IF(ISERROR(Q!B19),\"\",Q!B19)","v":0},"",{"$f":"'Sept-Data'!S10","v":""},{"$f":"'Sept-Data'!S12","v":""},{"$f":"'Sept-Data'!S11","v":""},0]
[{"$f":"IF(ISERROR(Q!A20),\"\",Q!A20)","v":0},{"$f":"IF(ISERROR(Q!B20),\"\",Q!B20)","v":0},"",{"$f":"'Sept-Data'!T10","v":""},{"$f":"'Sept-Data'!T12","v":""},{"$f":"'Sept-Data'!T11","v":""},0]
[{"$f":"IF(ISERROR(Q!A21),\"\",Q!A21)","v":0},{"$f":"IF(ISERROR(Q!B21),\"\",Q!B21)","v":0},"",{"$f":"'Sept-Data'!U10","v":""},{"$f":"'Sept-Data'!U12","v":""},{"$f":"'Sept-Data'!U11","v":""},0]
[{"$f":"IF(ISERROR(Q!A22),\"\",Q!A22)","v":0},{"$f":"IF(ISERROR(Q!B22),\"\",Q!B22)","v":0},"",{"$f":"'Sept-Data'!V10","v":""},{"$f":"'Sept-Data'!V12","v":""},{"$f":"'Sept-Data'!V11","v":""},0]
[{"$f":"IF(ISERROR(Q!A23),\"\",Q!A23)","v":0},{"$f":"IF(ISERROR(Q!B23),\"\",Q!B23)","v":0},"",{"$f":"'Sept-Data'!W10","v":""},{"$f":"'Sept-Data'!W12","v":""},{"$f":"'Sept-Data'!W11","v":""},0]
[{"$f":"IF(ISERROR(Q!A24),\"\",Q!A24)","v":0},{"$f":"IF(ISERROR(Q!B24),\"\",Q!B24)","v":0},"",{"$f":"'Sept-Data'!X10","v":""},{"$f":"'Sept-Data'!X12","v":""},{"$f":"'Sept-Data'!X11","v":""},0]
[{"$f":"IF(ISERROR(Q!A25),\"\",Q!A25)","v":0},{"$f":"IF(ISERROR(Q!B25),\"\",Q!B25)","v":0},"",{"$f":"'Sept-Data'!Y10","v":""},{"$f":"'Sept-Data'!Y12","v":""},{"$f":"'Sept-Data'!Y11","v":""},0]
[{"$f":"IF(ISERROR(Q!A26),\"\",Q!A26)","v":0},{"$f":"IF(ISERROR(Q!B26),\"\",Q!B26)","v":0},"",{"$f":"'Sept-Data'!Z10","v":""},{"$f":"'Sept-Data'!Z12","v":""},{"$f":"'Sept-Data'!Z11","v":""},0]
[{"$f":"IF(ISERROR(Q!A27),\"\",Q!A27)","v":0},{"$f":"IF(ISERROR(Q!B27),\"\",Q!B27)","v":0},"",{"$f":"'Sept-Data'!AA10","v":""},{"$f":"'Sept-Data'!AA12","v":""},{"$f":"'Sept-Data'!AA11","v":""},0]
[{"$f":"IF(ISERROR(Q!A28),\"\",Q!A28)","v":0},{"$f":"IF(ISERROR(Q!B28),\"\",Q!B28)","v":0},"",{"$f":"'Sept-Data'!AB10","v":""},{"$f":"'Sept-Data'!AB12","v":""},{"$f":"'Sept-Data'!AB11","v":""},0]
[{"$f":"IF(ISERROR(Q!A29),\"\",Q!A29)","v":0},{"$f":"IF(ISERROR(Q!B29),\"\",Q!B29)","v":0},"",{"$f":"'Sept-Data'!AC10","v":""},{"$f":"'Sept-Data'!AC12","v":""},{"$f":"'Sept-Data'!AC11","v":""},0]
[{"$f":"IF(ISERROR(Q!A30),\"\",Q!A30)","v":0},{"$f":"IF(ISERROR(Q!B30),\"\",Q!B30)","v":0},"",{"$f":"'Sept-Data'!AD10","v":""},{"$f":"'Sept-Data'!AD12","v":""},{"$f":"'Sept-Data'!AD11","v":""},0]
[{"$f":"IF(ISERROR(Q!A31),\"\",Q!A31)","v":0},{"$f":"IF(ISERROR(Q!B31),\"\",Q!B31)","v":0},"",{"$f":"'Sept-Data'!AE10","v":""},{"$f":"'Sept-Data'!AE12","v":""},{"$f":"'Sept-Data'!AE11","v":""},0]
[{"$f":"IF(ISERROR(Q!A32),\"\",Q!A32)","v":0},{"$f":"IF(ISERROR(Q!B32),\"\",Q!B32)","v":0},"",{"$f":"'Sept-Data'!AF10","v":""},{"$f":"'Sept-Data'!AF12","v":""},{"$f":"'Sept-Data'!AF11","v":""},0]
[{"$f":"IF(ISERROR(Q!A33),\"\",Q!A33)","v":0},{"$f":"IF(ISERROR(Q!B33),\"\",Q!B33)","v":0},"",{"$f":"'Sept-Data'!AG10","v":""},{"$f":"'Sept-Data'!AG12","v":""},{"$f":"'Sept-Data'!AG11","v":""},0]
[{"$f":"IF(ISERROR(Q!A34),\"\",Q!A34)","v":0},{"$f":"IF(ISERROR(Q!B34),\"\",Q!B34)","v":0},"",{"$f":"'Sept-Data'!AH10","v":""},{"$f":"'Sept-Data'!AH12","v":""},{"$f":"'Sept-Data'!AH11","v":""},0]
[{"$f":"IF(ISERROR(Q!A35),\"\",Q!A35)","v":0},{"$f":"IF(ISERROR(Q!B35),\"\",Q!B35)","v":0},"",{"$f":"'Sept-Data'!AI10","v":""},{"$f":"'Sept-Data'!AI12","v":""},{"$f":"'Sept-Data'!AI11","v":""},0]
[{"$f":"IF(ISERROR(Q!A36),\"\",Q!A36)","v":0},{"$f":"IF(ISERROR(Q!B36),\"\",Q!B36)","v":0},"",{"$f":"'Sept-Data'!AJ10","v":""},{"$f":"'Sept-Data'!AJ12","v":""},{"$f":"'Sept-Data'!AJ11","v":""},0]
[{"$f":"IF(ISERROR(Q!A37),\"\",Q!A37)","v":0},{"$f":"IF(ISERROR(Q!B37),\"\",Q!B37)","v":0},"",{"$f":"'Sept-Data'!AK10","v":""},{"$f":"'Sept-Data'!AK12","v":""},{"$f":"'Sept-Data'!AK11","v":""},0]
[{"$f":"IF(ISERROR(Q!A38),\"\",Q!A38)","v":0},{"$f":"IF(ISERROR(Q!B38),\"\",Q!B38)","v":0},"",{"$f":"'Sept-Data'!AL10","v":""},{"$f":"'Sept-Data'!AL12","v":""},{"$f":"'Sept-Data'!AL11","v":""},0]
[{"$f":"IF(ISERROR(Q!A39),\"\",Q!A39)","v":0},{"$f":"IF(ISERROR(Q!B39),\"\",Q!B39)","v":0},"",{"$f":"'Sept-Data'!AM10","v":""},{"$f":"'Sept-Data'!AM12","v":""},{"$f":"'Sept-Data'!AM11","v":""},0]
[{"$f":"IF(ISERROR(Q!A40),\"\",Q!A40)","v":0},{"$f":"IF(ISERROR(Q!B40),\"\",Q!B40)","v":0},"",{"$f":"'Sept-Data'!AN10","v":""},{"$f":"'Sept-Data'!AN12","v":""},{"$f":"'Sept-Data'!AN11","v":""},0]
[{"$f":"IF(ISERROR(Q!A41),\"\",Q!A41)","v":0},{"$f":"IF(ISERROR(Q!B41),\"\",Q!B41)","v":0},"",{"$f":"'Sept-Data'!AO10","v":""},{"$f":"'Sept-Data'!AO12","v":""},{"$f":"'Sept-Data'!AO11","v":""},0]
[null,null,null,null,null,null,{"$f":"COUNTIF(G11:G50,\">=1\")","v":11}]

{"sheet":"Sept-Raw","index":22,"n_rows":6,"n_cols":87,"rows_kept":6,"cut":false,"hidden":true,"merged":[[0,85,0,86],[0,63,0,64],[0,65,0,66],[0,67,0,68],[0,69,0,70],[0,71,0,72],[0,73,0,74],[0,75,0,76],[0,77,0,78],[0,79,0,80],[0,81,0,82],[0,83,0,84],[0,61,0,62],[0,39,0,40],[0,41,0,42],[0,43,0,44],[0,45,0,46],[0,47,0,48],[0,49,0,50],[0,51,0,52],[0,53,0,54],[0,55,0,56],[0,57,0,58],[0,59,0,60],[0,37,0,38],[0,15,0,16],[0,17,0,18],[0,19,0,20],[0,21,0,22],[0,23,0,24],[0,25,0,26],[0,27,0,28],[0,29,0,30],[0,31,0,32],[0,33,0,34],[0,35,0,36],[0,13,0,14],[0,0,0,5],[0,6,1,6],[0,7,0,8],[0,9,0,10],[0,11,0,12]]}
["Record details",null,null,null,null,null,"Notes",{"$f":"Q!A2","v":"Was a Room number documented?"},null,{"$f":"Q!A3","v":"Were stage A checks completed as appropriate?"},null,{"$f":"Q!A4","v":"Was COSI Part 1 performed?"},null,{"$f":"Q!A5","v":"Was PVP documented?"},null,{"$f":"Q!A6","v":"Was Otoscopy documented?"},null,{"$f":"Q!A7","v":"Document bc at 3 & 4kHz is for programming purposes?"},null,{"$f":"Q!A8","v":"Was Speech testing performed?"},null,{"$f":"Q!A9","v":"Is it documented whether national criteria were/were not met?"},null,{"$f":"Q!A10","v":"Was a BCHI info pack supplied?"},null,{"$f":"Q!A11","v":"Was the report authorised & issued within target (7 days)?"},null,{"$f":"Q!A12","v":"Was consent documented as appropriate?"},null,{"$f":"Q!A13","v":0},null,{"$f":"Q!A14","v":0},null,{"$f":"Q!A15","v":0},null,{"$f":"Q!A16","v":0},null,{"$f":"Q!A17","v":0},null,{"$f":"Q!A18","v":0},null,{"$f":"Q!A19","v":0},null,{"$f":"Q!A20","v":0},null,{"$f":"Q!A21","v":0},null,{"$f":"Q!A22","v":0},null,{"$f":"Q!A23","v":0},null,{"$f":"Q!A24","v":0},null,{"$f":"Q!A25","v":0},null,{"$f":"Q!A26","v":0},null,{"$f":"Q!A27","v":0},null,{"$f":"Q!A28","v":0},null,{"$f":"Q!A29","v":0},null,{"$f":"Q!A30","v":0},null,{"$f":"Q!A31","v":0},null,{"$f":"Q!A32","v":0},null,{"$f":"Q!A33","v":0},null,{"$f":"Q!A34","v":0},null,{"$f":"Q!A35","v":0},null,{"$f":"Q!A36","v":0},null,{"$f":"Q!A37","v":0},null,{"$f":"Q!A38","v":0},null,{"$f":"Q!A39","v":0},null,{"$f":"Q!A40","v":0},null,{"$f":"Q!A41","v":0}]
["Pt number","Date seen","Clinician 1","clinician 2","New/ F-up","Apt code",null,"Compliant?","Other result","Compliant?","Other result","Compliant?","Other result","Compliant?","Other result","Compliant?","Other result","Compliant?","Other result","Compliant?","Other result","Compliant?","Other result","Compliant?","Other result","Compliant?","Other result","Compliant?","Other result","Compliant?","Other result","Compliant?","Other result","Compliant?","Other result","Compliant?","Other result","Compliant?","Other result","Compliant?","Other result","Compliant?","Other result","Compliant?","Other result","Compliant?","Other result","Compliant?","Other result","Compliant?","Other result","Compliant?","Other result","Compliant?","Other result","Compliant?","Other result","Compliant?","Other result","Compliant?","Other result","Compliant?","Other result","Compliant?","Other result","Compliant?","Other result","Compliant?","Other result","Compliant?","Other result","Compliant?","Other result","Compliant?","Other result","Compliant?","Other result","Compliant?","Other result","Compliant?","Other result","Compliant?","Other result","Compliant?","Other result","Compliant?","Other result"]
["AB0001","2023-09-09","AA",null,"New","BA",null,"Yes",null,"Yes",null,"Yes",null,"Yes",null,"Yes",null,"Yes",null,"Yes",null,"Yes",null,"Yes",null,"Yes",null,"Yes"]
["AB0002","2023-09-17","AA",null,"New","BA",null,"Yes",null,"Yes",null,"Yes",null,"Yes",null,"Yes",null,"Yes",null,"Yes",null,"Yes",null,"Yes",null,"Yes",null,"Yes"]
["AB0003","2023-09-24","BB",null,"New","BA",null,"Yes",null,"Yes",null,"No",null,"Yes",null,"Yes",null,"Yes",null,"Yes",null,"Yes",null,"Yes",null,"Yes",null,"Yes"]
["AB0004","2023-09-26","BB",null,"New","BA",null,"Yes",null,"Yes",null,"Yes",null,"Yes",null,"Yes",null,"Yes",null,"Yes",null,"Yes",null,"Yes",null,"Yes",null,"Yes"]

{"sheet":"Sept-Data","index":23,"n_rows":12,"n_cols":41,"rows_kept":12,"cut":false,"hidden":true,"merged":[[0,0,1,0]]}
["Results",{"$f":"Q!A2","v":"Was a Room number documented?"},{"$f":"Q!A3","v":"Were stage A checks completed as appropriate?"},{"$f":"Q!A4","v":"Was COSI Part 1 performed?"},{"$f":"Q!A5","v":"Was PVP documented?"},{"$f":"Q!A6","v":"Was Otoscopy documented?"},{"$f":"Q!A7","v":"Document bc at 3 & 4kHz is for programming purposes?"},{"$f":"Q!A8","v":"Was Speech testing performed?"},{"$f":"Q!A9","v":"Is it documented whether national criteria were/were not met?"},{"$f":"Q!A10","v":"Was a BCHI info pack supplied?"},{"$f":"Q!A11","v":"Was the report authorised & issued within target (7 days)?"},{"$f":"Q!A12","v":"Was consent documented as appropriate?"},{"$f":"Q!A13","v":0},{"$f":"Q!A14","v":0},{"$f":"Q!A15","v":0},{"$f":"Q!A16","v":0},{"$f":"Q!A17","v":0},{"$f":"Q!A18","v":0},{"$f":"Q!A19","v":0},{"$f":"Q!A20","v":0},{"$f":"Q!A21","v":0},{"$f":"Q!A22","v":0},{"$f":"Q!A23","v":0},{"$f":"Q!A24","v":0},{"$f":"Q!A25","v":0},{"$f":"Q!A26","v":0},{"$f":"Q!A27","v":0},{"$f":"Q!A28","v":0},{"$f":"Q!A29","v":0},{"$f":"Q!A30","v":0},{"$f":"Q!A31","v":0},{"$f":"Q!A32","v":0},{"$f":"Q!A33","v":0},{"$f":"Q!A34","v":0},{"$f":"Q!A35","v":0},{"$f":"Q!A36","v":0},{"$f":"Q!A37","v":0},{"$f":"Q!A38","v":0},{"$f":"Q!A39","v":0},{"$f":"Q!A40","v":0},{"$f":"Q!A41","v":0}]
[null,"Compliant?","Compliant?","Compliant?","Compliant?","Compliant?","Compliant?","Compliant?","Compliant?","Compliant?","Compliant?","Compliant?","Compliant?","Compliant?","Compliant?","Compliant?","Compliant?","Compliant?","Compliant?","Compliant?","Compliant?","Compliant?","Compliant?","Compliant?","Compliant?","Compliant?","Compliant?","Compliant?","Compliant?","Compliant?","Compliant?","Compliant?","Compliant?","Compliant?","Compliant?","Compliant?","Compliant?","Compliant?","Compliant?","Compliant?","Compliant?"]
["Total Y",{"$f":"COUNTIF('Sept-Raw'!H:H,\"yes\")","v":4},{"$f":"COUNTIF('Sept-Raw'!J:J,\"yes\")","v":4},{"$f":"COUNTIF('Sept-Raw'!L:L,\"yes\")","v":3},{"$f":"COUNTIF('Sept-Raw'!N:N,\"yes\")","v":4},{"$f":"COUNTIF('Sept-Raw'!P:P,\"yes\")","v":4},{"$f":"COUNTIF('Sept-Raw'!R:R,\"yes\")","v":4},{"$f":"COUNTIF('Sept-Raw'!T:T,\"yes\")","v":4},{"$f":"COUNTIF('Sept-Raw'!V:V,\"yes\")","v":4},{"$f":"COUNTIF('Sept-Raw'!X:X,\"yes\")","v":4},{"$f":"COUNTIF('Sept-Raw'!Z:Z,\"yes\")","v":4},{"$f":"COUNTIF('Sept-Raw'!AB:AB,\"yes\")","v":4},{"$f":"COUNTIF('Sept-Raw'!AD:AD,\"yes\")","v":0},{"$f":"COUNTIF('Sept-Raw'!AF:AF,\"yes\")","v":0},{"$f":"COUNTIF('Sept-Raw'!AH:AH,\"yes\")","v":0},{"$f":"COUNTIF('Sept-Raw'!AJ:AJ,\"yes\")","v":0},{"$f":"COUNTIF('Sept-Raw'!AL:AL,\"yes\")","v":0},{"$f":"COUNTIF('Sept-Raw'!AN:AN,\"yes\")","v":0},{"$f":"COUNTIF('Sept-Raw'!AP:AP,\"yes\")","v":0},{"$f":"COUNTIF('Sept-Raw'!AR:AR,\"yes\")","v":0},{"$f":"COUNTIF('Sept-Raw'!AT:AT,\"yes\")","v":0},{"$f":"COUNTIF('Sept-Raw'!AV:AV,\"yes\")","v":0},{"$f":"COUNTIF('Sept-Raw'!AX:AX,\"yes\")","v":0},{"$f":"COUNTIF('Sept-Raw'!AZ:AZ,\"yes\")","v":0},{"$f":"COUNTIF('Sept-Raw'!BB:BB,\"yes\")","v":0},{"$f":"COUNTIF('Sept-Raw'!BD:BD,\"yes\")","v":0},{"$f":"COUNTIF('Sept-Raw'!BF:BF,\"yes\")","v":0},{"$f":"COUNTIF('Sept-Raw'!BH:BH,\"yes\")","v":0},{"$f":"COUNTIF('Sept-Raw'!BJ:BJ,\"yes\")","v":0},{"$f":"COUNTIF('Sept-Raw'!BL:BL,\"yes\")","v":0},{"$f":"COUNTIF('Sept-Raw'!BN:BN,\"yes\")","v":0},{"$f":"COUNTIF('Sept-Raw'!BP:BP,\"yes\")","v":0},{"$f":"COUNTIF('Sept-Raw'!BR:BR,\"yes\")","v":0},{"$f":"COUNTIF('Sept-Raw'!BT:BT,\"yes\")","v":0},{"$f":"COUNTIF('Sept-Raw'!BV:BV,\"yes\")","v":0},{"$f":"COUNTIF('Sept-Raw'!BX:BX,\"yes\")","v":0},{"$f":"COUNTIF('Sept-Raw'!BZ:BZ,\"yes\")","v":0},{"$f":"COUNTIF('Sept-Raw'!CB:CB,\"yes\")","v":0},{"$f":"COUNTIF('Sept-Raw'!CD:CD,\"yes\")","v":0},{"$f":"COUNTIF('Sept-Raw'!CF:CF,\"yes\")","v":0},{"$f":"COUNTIF('Sept-Raw'!CH:CH,\"yes\")","v":0}]
["Total N",{"$f":"COUNTIF('Sept-Raw'!H:H,\"no\")","v":0},{"$f":"COUNTIF('Sept-Raw'!J:J,\"no\")","v":0},{"$f":"COUNTIF('Sept-Raw'!L:L,\"no\")","v":1},{"$f":"COUNTIF('Sept-Raw'!N:N,\"no\")","v":0},{"$f":"COUNTIF('Sept-Raw'!P:P,\"no\")","v":0},{"$f":"COUNTIF('Sept-Raw'!R:R,\"no\")","v":0},{"$f":"COUNTIF('Sept-Raw'!T:T,\"no\")","v":0},{"$f":"COUNTIF('Sept-Raw'!V:V,\"no\")","v":0},{"$f":"COUNTIF('Sept-Raw'!X:X,\"no\")","v":0},{"$f":"COUNTIF('Sept-Raw'!Z:Z,\"no\")","v":0},{"$f":"COUNTIF('Sept-Raw'!AB:AB,\"no\")","v":0},{"$f":"COUNTIF('Sept-Raw'!AD:AD,\"no\")","v":0},{"$f":"COUNTIF('Sept-Raw'!AF:AF,\"no\")","v":0},{"$f":"COUNTIF('Sept-Raw'!AH:AH,\"no\")","v":0},{"$f":"COUNTIF('Sept-Raw'!AJ:AJ,\"no\")","v":0},{"$f":"COUNTIF('Sept-Raw'!AL:AL,\"no\")","v":0},{"$f":"COUNTIF('Sept-Raw'!AN:AN,\"no\")","v":0},{"$f":"COUNTIF('Sept-Raw'!AP:AP,\"no\")","v":0},{"$f":"COUNTIF('Sept-Raw'!AR:AR,\"no\")","v":0},{"$f":"COUNTIF('Sept-Raw'!AT:AT,\"no\")","v":0},{"$f":"COUNTIF('Sept-Raw'!AV:AV,\"no\")","v":0},{"$f":"COUNTIF('Sept-Raw'!AX:AX,\"no\")","v":0},{"$f":"COUNTIF('Sept-Raw'!AZ:AZ,\"no\")","v":0},{"$f":"COUNTIF('Sept-Raw'!BB:BB,\"no\")","v":0},{"$f":"COUNTIF('Sept-Raw'!BD:BD,\"no\")","v":0},{"$f":"COUNTIF('Sept-Raw'!BF:BF,\"no\")","v":0},{"$f":"COUNTIF('Sept-Raw'!BH:BH,\"no\")","v":0},{"$f":"COUNTIF('Sept-Raw'!BJ:BJ,\"no\")","v":0},{"$f":"COUNTIF('Sept-Raw'!BL:BL,\"no\")","v":0},{"$f":"COUNTIF('Sept-Raw'!BN:BN,\"no\")","v":0},{"$f":"COUNTIF('Sept-Raw'!BP:BP,\"no\")","v":0},{"$f":"COUNTIF('Sept-Raw'!BR:BR,\"no\")","v":0},{"$f":"COUNTIF('Sept-Raw'!BT:BT,\"no\")","v":0},{"$f":"COUNTIF('Sept-Raw'!BV:BV,\"no\")","v":0},{"$f":"COUNTIF('Sept-Raw'!BX:BX,\"no\")","v":0},{"$f":"COUNTIF('Sept-Raw'!BZ:BZ,\"no\")","v":0},{"$f":"COUNTIF('Sept-Raw'!CB:CB,\"no\")","v":0},{"$f":"COUNTIF('Sept-Raw'!CD:CD,\"no\")","v":0},{"$f":"COUNTIF('Sept-Raw'!CF:CF,\"no\")","v":0},{"$f":"COUNTIF('Sept-Raw'!CH:CH,\"no\")","v":0}]
["Total Justified",{"$f":"COUNTIF('Sept-Raw'!H:H,\"Justified\")","v":0},{"$f":"COUNTIF('Sept-Raw'!J:J,\"Justified\")","v":0},{"$f":"COUNTIF('Sept-Raw'!L:L,\"Justified\")","v":0},{"$f":"COUNTIF('Sept-Raw'!N:N,\"Justified\")","v":0},{"$f":"COUNTIF('Sept-Raw'!P:P,\"Justified\")","v":0},{"$f":"COUNTIF('Sept-Raw'!R:R,\"Justified\")","v":0},{"$f":"COUNTIF('Sept-Raw'!T:T,\"Justified\")","v":0},{"$f":"COUNTIF('Sept-Raw'!V:V,\"Justified\")","v":0},{"$f":"COUNTIF('Sept-Raw'!X:X,\"Justified\")","v":0},{"$f":"COUNTIF('Sept-Raw'!Z:Z,\"Justified\")","v":0},{"$f":"COUNTIF('Sept-Raw'!AB:AB,\"Justified\")","v":0},{"$f":"COUNTIF('Sept-Raw'!AD:AD,\"Justified\")","v":0},{"$f":"COUNTIF('Sept-Raw'!AF:AF,\"Justified\")","v":0},{"$f":"COUNTIF('Sept-Raw'!AH:AH,\"Justified\")","v":0},{"$f":"COUNTIF('Sept-Raw'!AJ:AJ,\"Justified\")","v":0},{"$f":"COUNTIF('Sept-Raw'!AL:AL,\"Justified\")","v":0},{"$f":"COUNTIF('Sept-Raw'!AN:AN,\"Justified\")","v":0},{"$f":"COUNTIF('Sept-Raw'!AP:AP,\"Justified\")","v":0},{"$f":"COUNTIF('Sept-Raw'!AR:AR,\"Justified\")","v":0},{"$f":"COUNTIF('Sept-Raw'!AT:AT,\"Justified\")","v":0},{"$f":"COUNTIF('Sept-Raw'!AV:AV,\"Justified\")","v":0},{"$f":"COUNTIF('Sept-Raw'!AX:AX,\"Justified\")","v":0},{"$f":"COUNTIF('Sept-Raw'!AZ:AZ,\"Justified\")","v":0},{"$f":"COUNTIF('Sept-Raw'!BB:BB,\"Justified\")","v":0},{"$f":"COUNTIF('Sept-Raw'!BD:BD,\"Justified\")","v":0},{"$f":"COUNTIF('Sept-Raw'!BF:BF,\"Justified\")","v":0},{"$f":"COUNTIF('Sept-Raw'!BH:BH,\"Justified\")","v":0},{"$f":"COUNTIF('Sept-Raw'!BJ:BJ,\"Justified\")","v":0},{"$f":"COUNTIF('Sept-Raw'!BL:BL,\"Justified\")","v":0},{"$f":"COUNTIF('Sept-Raw'!BN:BN,\"Justified\")","v":0},{"$f":"COUNTIF('Sept-Raw'!BP:BP,\"Justified\")","v":0},{"$f":"COUNTIF('Sept-Raw'!BR:BR,\"Justified\")","v":0},{"$f":"COUNTIF('Sept-Raw'!BT:BT,\"Justified\")","v":0},{"$f":"COUNTIF('Sept-Raw'!BV:BV,\"Justified\")","v":0},{"$f":"COUNTIF('Sept-Raw'!BX:BX,\"Justified\")","v":0},{"$f":"COUNTIF('Sept-Raw'!BZ:BZ,\"Justified\")","v":0},{"$f":"COUNTIF('Sept-Raw'!CB:CB,\"Justified\")","v":0},{"$f":"COUNTIF('Sept-Raw'!CD:CD,\"Justified\")","v":0},{"$f":"COUNTIF('Sept-Raw'!CF:CF,\"Justified\")","v":0},{"$f":"COUNTIF('Sept-Raw'!CH:CH,\"Justified\")","v":0}]
["Total NA",{"$f":"COUNTIF('Sept-Raw'!H:H,\"NA\")","v":0},{"$f":"COUNTIF('Sept-Raw'!J:J,\"NA\")","v":0},{"$f":"COUNTIF('Sept-Raw'!L:L,\"NA\")","v":0},{"$f":"COUNTIF('Sept-Raw'!N:N,\"NA\")","v":0},{"$f":"COUNTIF('Sept-Raw'!P:P,\"NA\")","v":0},{"$f":"COUNTIF('Sept-Raw'!R:R,\"NA\")","v":0},{"$f":"COUNTIF('Sept-Raw'!T:T,\"NA\")","v":0},{"$f":"COUNTIF('Sept-Raw'!V:V,\"NA\")","v":0},{"$f":"COUNTIF('Sept-Raw'!X:X,\"NA\")","v":0},{"$f":"COUNTIF('Sept-Raw'!Z:Z,\"NA\")","v":0},{"$f":"COUNTIF('Sept-Raw'!AB:AB,\"NA\")","v":0},{"$f":"COUNTIF('Sept-Raw'!AD:AD,\"NA\")","v":0},{"$f":"COUNTIF('Sept-Raw'!AF:AF,\"NA\")","v":0},{"$f":"COUNTIF('Sept-Raw'!AH:AH,\"NA\")","v":0},{"$f":"COUNTIF('Sept-Raw'!AJ:AJ,\"NA\")","v":0},{"$f":"COUNTIF('Sept-Raw'!AL:AL,\"NA\")","v":0},{"$f":"COUNTIF('Sept-Raw'!AN:AN,\"NA\")","v":0},{"$f":"COUNTIF('Sept-Raw'!AP:AP,\"NA\")","v":0},{"$f":"COUNTIF('Sept-Raw'!AR:AR,\"NA\")","v":0},{"$f":"COUNTIF('Sept-Raw'!AT:AT,\"NA\")","v":0},{"$f":"COUNTIF('Sept-Raw'!AV:AV,\"NA\")","v":0},{"$f":"COUNTIF('Sept-Raw'!AX:AX,\"NA\")","v":0},{"$f":"COUNTIF('Sept-Raw'!AZ:AZ,\"NA\")","v":0},{"$f":"COUNTIF('Sept-Raw'!BB:BB,\"NA\")","v":0},{"$f":"COUNTIF('Sept-Raw'!BD:BD,\"NA\")","v":0},{"$f":"COUNTIF('Sept-Raw'!BF:BF,\"NA\")","v":0},{"$f":"COUNTIF('Sept-Raw'!BH:BH,\"NA\")","v":0},{"$f":"COUNTIF('Sept-Raw'!BJ:BJ,\"NA\")","v":0},{"$f":"COUNTIF('Sept-Raw'!BL:BL,\"NA\")","v":0},{"$f":"COUNTIF('Sept-Raw'!BN:BN,\"NA\")","v":0},{"$f":"COUNTIF('Sept-Raw'!BP:BP,\"NA\")","v":0},{"$f":"COUNTIF('Sept-Raw'!BR:BR,\"NA\")","v":0},{"$f":"COUNTIF('Sept-Raw'!BT:BT,\"NA\")","v":0},{"$f":"COUNTIF('Sept-Raw'!BV:BV,\"NA\")","v":0},{"$f":"COUNTIF('Sept-Raw'!BX:BX,\"NA\")","v":0},{"$f":"COUNTIF('Sept-Raw'!BZ:BZ,\"NA\")","v":0},{"$f":"COUNTIF('Sept-Raw'!CB:CB,\"NA\")","v":0},{"$f":"COUNTIF('Sept-Raw'!CD:CD,\"NA\")","v":0},{"$f":"COUNTIF('Sept-Raw'!CF:CF,\"NA\")","v":0},{"$f":"COUNTIF('Sept-Raw'!CH:CH,\"NA\")","v":0}]
["Blanks",{"$f":"B8-(SUM(B3:B6))","v":0},{"$f":"C8-(SUM(C3:C6))","v":0},0,0,0,0,0,0,0,0,0,4,4,4,4,4,4,4,4,4,4,4,4,4,4,4,4,4,4,4,4,4,4,4,4,4,4,4,4,4]
["full sample size",{"$f":"COUNTA('Sept-Raw'!A:A)-2","v":4},{"$f":"B8","v":4},4,4,4,4,4,4,4,4,4,4,4,4,4,4,4,4,4,4,4,4,4,4,4,4,4,4,4,4,4,4,4,4,4,4,4,4,4,4]
["True sample size (-NA + blanks)",{"$f":"IF(ISERROR(B8-(B6+B7)),\"\",B8-(B6+B7))","v":4},{"$f":"IF(ISERROR(C8-(C6+C7)),\"\",C8-(C6+C7))","v":4},4,4,4,4,4,4,4,4,4,0,0,0,0,0,0,0,0,0,0,0,0,0,0,0,0,0,0,0,0,0,0,0,0,0,0,0,0,0]
["%Y",{"$f":"IF(ISERROR(B3/B9),\"\",B3/B9)","v":1},{"$f":"IF(ISERROR(C3/C9),\"\",C3/C9)","v":1},0.75,1,1,1,1,1,1,1,1,"","","","","","","","","","","","","","","","","","","","","","","","","","","","",""]
["%N",{"$f":"IF(ISERROR(B4/B9),\"\",B4/B9)","v":0},{"$f":"IF(ISERROR(C4/C9),\"\",C4/C9)","v":0},0.25,0,0,0,0,0,0,0,0,"","","","","","","","","","","","","","","","","","","","","","","","","","","","",""]
["%N - Justified",{"$f":"IF(ISERROR(B5/B9),\"\",B5/B9)","v":0},{"$f":"IF(ISERROR(C5/C9),\"\",C5/C9)","v":0},0,0,0,0,0,0,0,0,0,"","","","","","","","","","","","","","","","","","","","","","","","","","","","",""]

{"sheet":"Oct","index":24,"n_rows":51,"n_cols":8,"rows_kept":51,"cut":false,"hidden":false,"merged":[]}
["Click here to go to year overview"]
[]
["Date",null,null,"Total by Apt type"]
["Completed by",null,null,"New",{"$f":"COUNTIF('Oct-Raw'!E3:E103,\"New\")","v":3}]
["Sample group size",{"$f":"COUNTA('Oct-Raw'!A:A)-2","v":3},null,"Follow up",{"$f":"COUNTIF('Oct-Raw'!E3:E103,\"Fup\")","v":0},null,null,{"$f":"Year!H5","v":0.95}]
["Overall Result (compliant only)",{"$f":"IF(ISERROR(SUM(D11:D50)/G51),\"\",SUM(D11:D50)/G51)","v":0.96969696969696961},null,"Total by apt Code",null,null,null,{"$f":"Year!H6","v":"80-95%"}]
["Overall Result (compliant & Justified)",{"$f":"IF(ISERROR(SUM(C11:C50)/G51),\"\",SUM(C11:C50)/G51)","v":1},null,"code goes in here",{"$f":"COUNTIF('Oct-Raw'!F3:F103,D7)","v":0},null,null,{"$f":"Year!H7","v":0.8}]
["viable qs",{"$f":"G51","v":11}]
[]
["Metric","Target %","Compliant + Justified","Compliant","Justified","Not compliant","Irritating math"]
[{"$f":"IF(ISERROR(Q!A2),\"\",Q!A2)","v":"Was a Room number documented?"},{"$f":"IF(ISERROR(Q!B2),\"\",Q!B2)","v":0},{"$f":"IF(ISERROR(D11+E11),\"\",D11+E11)","v":1},{"$f":"'Oct-Data'!B10","v":1},{"$f":"'Oct-Data'!B12","v":0},{"$f":"'Oct-Data'!B11","v":0},{"$f":"COUNTIF(D11:F11,\">0\")","v":1}]
[{"$f":"IF(ISERROR(Q!A3),\"\",Q!A3)","v":"Were stage A checks completed as appropriate?"},{"$f":"IF(ISERROR(Q!B3),\"\",Q!B3)","v":0},1,{"$f":"'Oct-Data'!C10","v":1},{"$f":"'Oct-Data'!C12","v":0},{"$f":"'Oct-Data'!C11","v":0},1]
[{"$f":"IF(ISERROR(Q!A4),\"\",Q!A4)","v":"Was COSI Part 1 performed?"},{"$f":"IF(ISERROR(Q!B4),\"\",Q!B4)","v":0},1,{"$f":"'Oct-Data'!D10","v":1},{"$f":"'Oct-Data'!D12","v":0},{"$f":"'Oct-Data'!D11","v":0},1]
[{"$f":"IF(ISERROR(Q!A5),\"\",Q!A5)","v":"Was PVP documented?"},{"$f":"IF(ISERROR(Q!B5),\"\",Q!B5)","v":0},1,{"$f":"'Oct-Data'!E10","v":1},{"$f":"'Oct-Data'!E12","v":0},{"$f":"'Oct-Data'!E11","v":0},1]
[{"$f":"IF(ISERROR(Q!A6),\"\",Q!A6)","v":"Was Otoscopy documented?"},{"$f":"IF(ISERROR(Q!B6),\"\",Q!B6)","v":0},1,{"$f":"'Oct-Data'!F10","v":1},{"$f":"'Oct-Data'!F12","v":0},{"$f":"'Oct-Data'!F11","v":0},1]
[{"$f":"IF(ISERROR(Q!A7),\"\",Q!A7)","v":"Document bc at 3 & 4kHz is for programming purposes?"},{"$f":"IF(ISERROR(Q!B7),\"\",Q!B7)","v":0},1,{"$f":"'Oct-Data'!G10","v":1},{"$f":"'Oct-Data'!G12","v":0},{"$f":"'Oct-Data'!G11","v":0},1]
[{"$f":"IF(ISERROR(Q!A8),\"\",Q!A8)","v":"Was Speech testing performed?"},{"$f":"IF(ISERROR(Q!B8),\"\",Q!B8)","v":0},1,{"$f":"'Oct-Data'!H10","v":1},{"$f":"'Oct-Data'!H12","v":0},{"$f":"'Oct-Data'!H11","v":0},1]
[{"$f":"IF(ISERROR(Q!A9),\"\",Q!A9)","v":"Is it documented whether national criteria were/were not met?"},{"$f":"IF(ISERROR(Q!B9),\"\",Q!B9)","v":0},1,{"$f":"'Oct-Data'!I10","v":1},{"$f":"'Oct-Data'!I12","v":0},{"$f":"'Oct-Data'!I11","v":0},1]
[{"$f":"IF(ISERROR(Q!A10),\"\",Q!A10)","v":"Was a BCHI info pack supplied?"},{"$f":"IF(ISERROR(Q!B10),\"\",Q!B10)","v":0},1,{"$f":"'Oct-Data'!J10","v":0.66666666666666663},{"$f":"'Oct-Data'!J12","v":0.33333333333333331},{"$f":"'Oct-Data'!J11","v":0},2]
[{"$f":"IF(ISERROR(Q!A11),\"\",Q!A11)","v":"Was the report authorised & issued within target (7 days)?"},{"$f":"IF(ISERROR(Q!B11),\"\",Q!B11)","v":0},1,{"$f":"'Oct-Data'!K10","v":1},{"$f":"'Oct-Data'!K12","v":0},{"$f":"'Oct-Data'!K11","v":0},1]
[{"$f":"IF(ISERROR(Q!A12),\"\",Q!A12)","v":"Was consent documented as appropriate?"},{"$f":"IF(ISERROR(Q!B12),\"\",Q!B12)","v":0},1,{"$f":"'Oct-Data'!L10","v":1},{"$f":"'Oct-Data'!L12","v":0},{"$f":"'Oct-Data'!L11","v":0},1]
[{"$f":"IF(ISERROR(Q!A13),\"\",Q!A13)","v":0},{"$f":"IF(ISERROR(Q!B13),\"\",Q!B13)","v":0},"",{"$f":"'Oct-Data'!M10","v":""},{"$f":"'Oct-Data'!M12","v":""},{"$f":"'Oct-Data'!M11","v":""},0]
[{"$f":"IF(ISERROR(Q!A14),\"\",Q!A14)","v":0},{"$f":"IF(ISERROR(Q!B14),\"\",Q!B14)","v":0},"",{"$f":"'Oct-Data'!N10","v":""},{"$f":"'Oct-Data'!N12","v":""},{"$f":"'Oct-Data'!N11","v":""},0]
[{"$f":"IF(ISERROR(Q!A15),\"\",Q!A15)","v":0},{"$f":"IF(ISERROR(Q!B15),\"\",Q!B15)","v":0},"",{"$f":"'Oct-Data'!O10","v":""},{"$f":"'Oct-Data'!O12","v":""},{"$f":"'Oct-Data'!O11","v":""},0]
[{"$f":"IF(ISERROR(Q!A16),\"\",Q!A16)","v":0},{"$f":"IF(ISERROR(Q!B16),\"\",Q!B16)","v":0},"",{"$f":"'Oct-Data'!P10","v":""},{"$f":"'Oct-Data'!P12","v":""},{"$f":"'Oct-Data'!P11","v":""},0]
[{"$f":"IF(ISERROR(Q!A17),\"\",Q!A17)","v":0},{"$f":"IF(ISERROR(Q!B17),\"\",Q!B17)","v":0},"",{"$f":"'Oct-Data'!Q10","v":""},{"$f":"'Oct-Data'!Q12","v":""},{"$f":"'Oct-Data'!Q11","v":""},0]
[{"$f":"IF(ISERROR(Q!A18),\"\",Q!A18)","v":0},{"$f":"IF(ISERROR(Q!B18),\"\",Q!B18)","v":0},"",{"$f":"'Oct-Data'!R10","v":""},{"$f":"'Oct-Data'!R12","v":""},{"$f":"'Oct-Data'!R11","v":""},0]
[{"$f":"IF(ISERROR(Q!A19),\"\",Q!A19)","v":0},{"$f":"IF(ISERROR(Q!B19),\"\",Q!B19)","v":0},"",{"$f":"'Oct-Data'!S10","v":""},{"$f":"'Oct-Data'!S12","v":""},{"$f":"'Oct-Data'!S11","v":""},0]
[{"$f":"IF(ISERROR(Q!A20),\"\",Q!A20)","v":0},{"$f":"IF(ISERROR(Q!B20),\"\",Q!B20)","v":0},"",{"$f":"'Oct-Data'!T10","v":""},{"$f":"'Oct-Data'!T12","v":""},{"$f":"'Oct-Data'!T11","v":""},0]
[{"$f":"IF(ISERROR(Q!A21),\"\",Q!A21)","v":0},{"$f":"IF(ISERROR(Q!B21),\"\",Q!B21)","v":0},"",{"$f":"'Oct-Data'!U10","v":""},{"$f":"'Oct-Data'!U12","v":""},{"$f":"'Oct-Data'!U11","v":""},0]
[{"$f":"IF(ISERROR(Q!A22),\"\",Q!A22)","v":0},{"$f":"IF(ISERROR(Q!B22),\"\",Q!B22)","v":0},"",{"$f":"'Oct-Data'!V10","v":""},{"$f":"'Oct-Data'!V12","v":""},{"$f":"'Oct-Data'!V11","v":""},0]
[{"$f":"IF(ISERROR(Q!A23),\"\",Q!A23)","v":0},{"$f":"IF(ISERROR(Q!B23),\"\",Q!B23)","v":0},"",{"$f":"'Oct-Data'!W10","v":""},{"$f":"'Oct-Data'!W12","v":""},{"$f":"'Oct-Data'!W11","v":""},0]
[{"$f":"IF(ISERROR(Q!A24),\"\",Q!A24)","v":0},{"$f":"IF(ISERROR(Q!B24),\"\",Q!B24)","v":0},"",{"$f":"'Oct-Data'!X10","v":""},{"$f":"'Oct-Data'!X12","v":""},{"$f":"'Oct-Data'!X11","v":""},0]
[{"$f":"IF(ISERROR(Q!A25),\"\",Q!A25)","v":0},{"$f":"IF(ISERROR(Q!B25),\"\",Q!B25)","v":0},"",{"$f":"'Oct-Data'!Y10","v":""},{"$f":"'Oct-Data'!Y12","v":""},{"$f":"'Oct-Data'!Y11","v":""},0]
[{"$f":"IF(ISERROR(Q!A26),\"\",Q!A26)","v":0},{"$f":"IF(ISERROR(Q!B26),\"\",Q!B26)","v":0},"",{"$f":"'Oct-Data'!Z10","v":""},{"$f":"'Oct-Data'!Z12","v":""},{"$f":"'Oct-Data'!Z11","v":""},0]
[{"$f":"IF(ISERROR(Q!A27),\"\",Q!A27)","v":0},{"$f":"IF(ISERROR(Q!B27),\"\",Q!B27)","v":0},"",{"$f":"'Oct-Data'!AA10","v":""},{"$f":"'Oct-Data'!AA12","v":""},{"$f":"'Oct-Data'!AA11","v":""},0]
[{"$f":"IF(ISERROR(Q!A28),\"\",Q!A28)","v":0},{"$f":"IF(ISERROR(Q!B28),\"\",Q!B28)","v":0},"",{"$f":"'Oct-Data'!AB10","v":""},{"$f":"'Oct-Data'!AB12","v":""},{"$f":"'Oct-Data'!AB11","v":""},0]
[{"$f":"IF(ISERROR(Q!A29),\"\",Q!A29)","v":0},{"$f":"IF(ISERROR(Q!B29),\"\",Q!B29)","v":0},"",{"$f":"'Oct-Data'!AC10","v":""},{"$f":"'Oct-Data'!AC12","v":""},{"$f":"'Oct-Data'!AC11","v":""},0]
[{"$f":"IF(ISERROR(Q!A30),\"\",Q!A30)","v":0},{"$f":"IF(ISERROR(Q!B30),\"\",Q!B30)","v":0},"",{"$f":"'Oct-Data'!AD10","v":""},{"$f":"'Oct-Data'!AD12","v":""},{"$f":"'Oct-Data'!AD11","v":""},0]
[{"$f":"IF(ISERROR(Q!A31),\"\",Q!A31)","v":0},{"$f":"IF(ISERROR(Q!B31),\"\",Q!B31)","v":0},"",{"$f":"'Oct-Data'!AE10","v":""},{"$f":"'Oct-Data'!AE12","v":""},{"$f":"'Oct-Data'!AE11","v":""},0]
[{"$f":"IF(ISERROR(Q!A32),\"\",Q!A32)","v":0},{"$f":"IF(ISERROR(Q!B32),\"\",Q!B32)","v":0},"",{"$f":"'Oct-Data'!AF10","v":""},{"$f":"'Oct-Data'!AF12","v":""},{"$f":"'Oct-Data'!AF11","v":""},0]
[{"$f":"IF(ISERROR(Q!A33),\"\",Q!A33)","v":0},{"$f":"IF(ISERROR(Q!B33),\"\",Q!B33)","v":0},"",{"$f":"'Oct-Data'!AG10","v":""},{"$f":"'Oct-Data'!AG12","v":""},{"$f":"'Oct-Data'!AG11","v":""},0]
[{"$f":"IF(ISERROR(Q!A34),\"\",Q!A34)","v":0},{"$f":"IF(ISERROR(Q!B34),\"\",Q!B34)","v":0},"",{"$f":"'Oct-Data'!AH10","v":""},{"$f":"'Oct-Data'!AH12","v":""},{"$f":"'Oct-Data'!AH11","v":""},0]
[{"$f":"IF(ISERROR(Q!A35),\"\",Q!A35)","v":0},{"$f":"IF(ISERROR(Q!B35),\"\",Q!B35)","v":0},"",{"$f":"'Oct-Data'!AI10","v":""},{"$f":"'Oct-Data'!AI12","v":""},{"$f":"'Oct-Data'!AI11","v":""},0]
[{"$f":"IF(ISERROR(Q!A36),\"\",Q!A36)","v":0},{"$f":"IF(ISERROR(Q!B36),\"\",Q!B36)","v":0},"",{"$f":"'Oct-Data'!AJ10","v":""},{"$f":"'Oct-Data'!AJ12","v":""},{"$f":"'Oct-Data'!AJ11","v":""},0]
[{"$f":"IF(ISERROR(Q!A37),\"\",Q!A37)","v":0},{"$f":"IF(ISERROR(Q!B37),\"\",Q!B37)","v":0},"",{"$f":"'Oct-Data'!AK10","v":""},{"$f":"'Oct-Data'!AK12","v":""},{"$f":"'Oct-Data'!AK11","v":""},0]
[{"$f":"IF(ISERROR(Q!A38),\"\",Q!A38)","v":0},{"$f":"IF(ISERROR(Q!B38),\"\",Q!B38)","v":0},"",{"$f":"'Oct-Data'!AL10","v":""},{"$f":"'Oct-Data'!AL12","v":""},{"$f":"'Oct-Data'!AL11","v":""},0]
[{"$f":"IF(ISERROR(Q!A39),\"\",Q!A39)","v":0},{"$f":"IF(ISERROR(Q!B39),\"\",Q!B39)","v":0},"",{"$f":"'Oct-Data'!AM10","v":""},{"$f":"'Oct-Data'!AM12","v":""},{"$f":"'Oct-Data'!AM11","v":""},0]
[{"$f":"IF(ISERROR(Q!A40),\"\",Q!A40)","v":0},{"$f":"IF(ISERROR(Q!B40),\"\",Q!B40)","v":0},"",{"$f":"'Oct-Data'!AN10","v":""},{"$f":"'Oct-Data'!AN12","v":""},{"$f":"'Oct-Data'!AN11","v":""},0]
[{"$f":"IF(ISERROR(Q!A41),\"\",Q!A41)","v":0},{"$f":"IF(ISERROR(Q!B41),\"\",Q!B41)","v":0},"",{"$f":"'Oct-Data'!AO10","v":""},{"$f":"'Oct-Data'!AO12","v":""},{"$f":"'Oct-Data'!AO11","v":""},0]
[null,null,null,null,null,null,{"$f":"COUNTIF(G11:G50,\">=1\")","v":11}]

{"sheet":"Oct-Raw","index":25,"n_rows":5,"n_cols":87,"rows_kept":5,"cut":false,"hidden":true,"merged":[[0,85,0,86],[0,63,0,64],[0,65,0,66],[0,67,0,68],[0,69,0,70],[0,71,0,72],[0,73,0,74],[0,75,0,76],[0,77,0,78],[0,79,0,80],[0,81,0,82],[0,83,0,84],[0,61,0,62],[0,39,0,40],[0,41,0,42],[0,43,0,44],[0,45,0,46],[0,47,0,48],[0,49,0,50],[0,51,0,52],[0,53,0,54],[0,55,0,56],[0,57,0,58],[0,59,0,60],[0,37,0,38],[0,15,0,16],[0,17,0,18],[0,19,0,20],[0,21,0,22],[0,23,0,24],[0,25,0,26],[0,27,0,28],[0,29,0,30],[0,31,0,32],[0,33,0,34],[0,35,0,36],[0,13,0,14],[0,0,0,5],[0,6,1,6],[0,7,0,8],[0,9,0,10],[0,11,0,12]]}
["Record details",null,null,null,null,null,"Notes",{"$f":"Q!A2","v":"Was a Room number documented?"},null,{"$f":"Q!A3","v":"Were stage A checks completed as appropriate?"},null,{"$f":"Q!A4","v":"Was COSI Part 1 performed?"},null,{"$f":"Q!A5","v":"Was PVP documented?"},null,{"$f":"Q!A6","v":"Was Otoscopy documented?"},null,{"$f":"Q!A7","v":"Document bc at 3 & 4kHz is for programming purposes?"},null,{"$f":"Q!A8","v":"Was Speech testing performed?"},null,{"$f":"Q!A9","v":"Is it documented whether national criteria were/were not met?"},null,{"$f":"Q!A10","v":"Was a BCHI info pack supplied?"},null,{"$f":"Q!A11","v":"Was the report authorised & issued within target (7 days)?"},null,{"$f":"Q!A12","v":"Was consent documented as appropriate?"},null,{"$f":"Q!A13","v":0},null,{"$f":"Q!A14","v":0},null,{"$f":"Q!A15","v":0},null,{"$f":"Q!A16","v":0},null,{"$f":"Q!A17","v":0},null,{"$f":"Q!A18","v":0},null,{"$f":"Q!A19","v":0},null,{"$f":"Q!A20","v":0},null,{"$f":"Q!A21","v":0},null,{"$f":"Q!A22","v":0},null,{"$f":"Q!A23","v":0},null,{"$f":"Q!A24","v":0},null,{"$f":"Q!A25","v":0},null,{"$f":"Q!A26","v":0},null,{"$f":"Q!A27","v":0},null,{"$f":"Q!A28","v":0},null,{"$f":"Q!A29","v":0},null,{"$f":"Q!A30","v":0},null,{"$f":"Q!A31","v":0},null,{"$f":"Q!A32","v":0},null,{"$f":"Q!A33","v":0},null,{"$f":"Q!A34","v":0},null,{"$f":"Q!A35","v":0},null,{"$f":"Q!A36","v":0},null,{"$f":"Q!A37","v":0},null,{"$f":"Q!A38","v":0},null,{"$f":"Q!A39","v":0},null,{"$f":"Q!A40","v":0},null,{"$f":"Q!A41","v":0}]
["Pt number","Date seen","Clinician 1","clinician 2","New/ F-up","Apt code",null,"Compliant?","Other result","Compliant?","Other result","Compliant?","Other result","Compliant?","Other result","Compliant?","Other result","Compliant?","Other result","Compliant?","Other result","Compliant?","Other result","Compliant?","Other result","Compliant?","Other result","Compliant?","Other result","Compliant?","Other result","Compliant?","Other result","Compliant?","Other result","Compliant?","Other result","Compliant?","Other result","Compliant?","Other result","Compliant?","Other result","Compliant?","Other result","Compliant?","Other result","Compliant?","Other result","Compliant?","Other result","Compliant?","Other result","Compliant?","Other result","Compliant?","Other result","Compliant?","Other result","Compliant?","Other result","Compliant?","Other result","Compliant?","Other result","Compliant?","Other result","Compliant?","Other result","Compliant?","Other result","Compliant?","Other result","Compliant?","Other result","Compliant?","Other result","Compliant?","Other result","Compliant?","Other result","Compliant?","Other result","Compliant?","Other result","Compliant?","Other result"]
["AB0001","2023-10-10","AA",null,"New","BA",null,"Yes",null,"Yes",null,"Yes",null,"Yes",null,"Yes",null,"Yes",null,"Yes",null,"Yes",null,"Yes",null,"Yes",null,"Yes"]
["AB0002","2023-10-17","AA",null,"New","BA",null,"Yes",null,"Yes",null,"Yes",null,"Yes",null,"Yes",null,"Yes",null,"Yes",null,"Yes",null,"Justified","Previous user from outside area","Yes",null,"Yes"]
["AB0003","2023-10-24","BB",null,"New","BA",null,"Yes",null,"Yes",null,"Yes",null,"Yes",null,"Yes",null,"Yes",null,"Yes",null,"Yes",null,"Yes",null,"Yes",null,"Yes"]

{"sheet":"Oct-Data","index":26,"n_rows":12,"n_cols":41,"rows_kept":12,"cut":false,"hidden":true,"merged":[[0,0,1,0]]}
["Results",{"$f":"Q!A2","v":"Was a Room number documented?"},{"$f":"Q!A3","v":"Were stage A checks completed as appropriate?"},{"$f":"Q!A4","v":"Was COSI Part 1 performed?"},{"$f":"Q!A5","v":"Was PVP documented?"},{"$f":"Q!A6","v":"Was Otoscopy documented?"},{"$f":"Q!A7","v":"Document bc at 3 & 4kHz is for programming purposes?"},{"$f":"Q!A8","v":"Was Speech testing performed?"},{"$f":"Q!A9","v":"Is it documented whether national criteria were/were not met?"},{"$f":"Q!A10","v":"Was a BCHI info pack supplied?"},{"$f":"Q!A11","v":"Was the report authorised & issued within target (7 days)?"},{"$f":"Q!A12","v":"Was consent documented as appropriate?"},{"$f":"Q!A13","v":0},{"$f":"Q!A14","v":0},{"$f":"Q!A15","v":0},{"$f":"Q!A16","v":0},{"$f":"Q!A17","v":0},{"$f":"Q!A18","v":0},{"$f":"Q!A19","v":0},{"$f":"Q!A20","v":0},{"$f":"Q!A21","v":0},{"$f":"Q!A22","v":0},{"$f":"Q!A23","v":0},{"$f":"Q!A24","v":0},{"$f":"Q!A25","v":0},{"$f":"Q!A26","v":0},{"$f":"Q!A27","v":0},{"$f":"Q!A28","v":0},{"$f":"Q!A29","v":0},{"$f":"Q!A30","v":0},{"$f":"Q!A31","v":0},{"$f":"Q!A32","v":0},{"$f":"Q!A33","v":0},{"$f":"Q!A34","v":0},{"$f":"Q!A35","v":0},{"$f":"Q!A36","v":0},{"$f":"Q!A37","v":0},{"$f":"Q!A38","v":0},{"$f":"Q!A39","v":0},{"$f":"Q!A40","v":0},{"$f":"Q!A41","v":0}]
[null,"Compliant?","Compliant?","Compliant?","Compliant?","Compliant?","Compliant?","Compliant?","Compliant?","Compliant?","Compliant?","Compliant?","Compliant?","Compliant?","Compliant?","Compliant?","Compliant?","Compliant?","Compliant?","Compliant?","Compliant?","Compliant?","Compliant?","Compliant?","Compliant?","Compliant?","Compliant?","Compliant?","Compliant?","Compliant?","Compliant?","Compliant?","Compliant?","Compliant?","Compliant?","Compliant?","Compliant?","Compliant?","Compliant?","Compliant?","Compliant?"]
["Total Y",{"$f":"COUNTIF('Oct-Raw'!H:H,\"yes\")","v":3},{"$f":"COUNTIF('Oct-Raw'!J:J,\"yes\")","v":3},{"$f":"COUNTIF('Oct-Raw'!L:L,\"yes\")","v":3},{"$f":"COUNTIF('Oct-Raw'!N:N,\"yes\")","v":3},{"$f":"COUNTIF('Oct-Raw'!P:P,\"yes\")","v":3},{"$f":"COUNTIF('Oct-Raw'!R:R,\"yes\")","v":3},{"$f":"COUNTIF('Oct-Raw'!T:T,\"yes\")","v":3},{"$f":"COUNTIF('Oct-Raw'!V:V,\"yes\")","v":3},{"$f":"COUNTIF('Oct-Raw'!X:X,\"yes\")","v":2},{"$f":"COUNTIF('Oct-Raw'!Z:Z,\"yes\")","v":3},{"$f":"COUNTIF('Oct-Raw'!AB:AB,\"yes\")","v":3},{"$f":"COUNTIF('Oct-Raw'!AD:AD,\"yes\")","v":0},{"$f":"COUNTIF('Oct-Raw'!AF:AF,\"yes\")","v":0},{"$f":"COUNTIF('Oct-Raw'!AH:AH,\"yes\")","v":0},{"$f":"COUNTIF('Oct-Raw'!AJ:AJ,\"yes\")","v":0},{"$f":"COUNTIF('Oct-Raw'!AL:AL,\"yes\")","v":0},{"$f":"COUNTIF('Oct-Raw'!AN:AN,\"yes\")","v":0},{"$f":"COUNTIF('Oct-Raw'!AP:AP,\"yes\")","v":0},{"$f":"COUNTIF('Oct-Raw'!AR:AR,\"yes\")","v":0},{"$f":"COUNTIF('Oct-Raw'!AT:AT,\"yes\")","v":0},{"$f":"COUNTIF('Oct-Raw'!AV:AV,\"yes\")","v":0},{"$f":"COUNTIF('Oct-Raw'!AX:AX,\"yes\")","v":0},{"$f":"COUNTIF('Oct-Raw'!AZ:AZ,\"yes\")","v":0},{"$f":"COUNTIF('Oct-Raw'!BB:BB,\"yes\")","v":0},{"$f":"COUNTIF('Oct-Raw'!BD:BD,\"yes\")","v":0},{"$f":"COUNTIF('Oct-Raw'!BF:BF,\"yes\")","v":0},{"$f":"COUNTIF('Oct-Raw'!BH:BH,\"yes\")","v":0},{"$f":"COUNTIF('Oct-Raw'!BJ:BJ,\"yes\")","v":0},{"$f":"COUNTIF('Oct-Raw'!BL:BL,\"yes\")","v":0},{"$f":"COUNTIF('Oct-Raw'!BN:BN,\"yes\")","v":0},{"$f":"COUNTIF('Oct-Raw'!BP:BP,\"yes\")","v":0},{"$f":"COUNTIF('Oct-Raw'!BR:BR,\"yes\")","v":0},{"$f":"COUNTIF('Oct-Raw'!BT:BT,\"yes\")","v":0},{"$f":"COUNTIF('Oct-Raw'!BV:BV,\"yes\")","v":0},{"$f":"COUNTIF('Oct-Raw'!BX:BX,\"yes\")","v":0},{"$f":"COUNTIF('Oct-Raw'!BZ:BZ,\"yes\")","v":0},{"$f":"COUNTIF('Oct-Raw'!CB:CB,\"yes\")","v":0},{"$f":"COUNTIF('Oct-Raw'!CD:CD,\"yes\")","v":0},{"$f":"COUNTIF('Oct-Raw'!CF:CF,\"yes\")","v":0},{"$f":"COUNTIF('Oct-Raw'!CH:CH,\"yes\")","v":0}]
["Total N",{"$f":"COUNTIF('Oct-Raw'!H:H,\"no\")","v":0},{"$f":"COUNTIF('Oct-Raw'!J:J,\"no\")","v":0},{"$f":"COUNTIF('Oct-Raw'!L:L,\"no\")","v":0},{"$f":"COUNTIF('Oct-Raw'!N:N,\"no\")","v":0},{"$f":"COUNTIF('Oct-Raw'!P:P,\"no\")","v":0},{"$f":"COUNTIF('Oct-Raw'!R:R,\"no\")","v":0},{"$f":"COUNTIF('Oct-Raw'!T:T,\"no\")","v":0},{"$f":"COUNTIF('Oct-Raw'!V:V,\"no\")","v":0},{"$f":"COUNTIF('Oct-Raw'!X:X,\"no\")","v":0},{"$f":"COUNTIF('Oct-Raw'!Z:Z,\"no\")","v":0},{"$f":"COUNTIF('Oct-Raw'!AB:AB,\"no\")","v":0},{"$f":"COUNTIF('Oct-Raw'!AD:AD,\"no\")","v":0},{"$f":"COUNTIF('Oct-Raw'!AF:AF,\"no\")","v":0},{"$f":"COUNTIF('Oct-Raw'!AH:AH,\"no\")","v":0},{"$f":"COUNTIF('Oct-Raw'!AJ:AJ,\"no\")","v":0},{"$f":"COUNTIF('Oct-Raw'!AL:AL,\"no\")","v":0},{"$f":"COUNTIF('Oct-Raw'!AN:AN,\"no\")","v":0},{"$f":"COUNTIF('Oct-Raw'!AP:AP,\"no\")","v":0},{"$f":"COUNTIF('Oct-Raw'!AR:AR,\"no\")","v":0},{"$f":"COUNTIF('Oct-Raw'!AT:AT,\"no\")","v":0},{"$f":"COUNTIF('Oct-Raw'!AV:AV,\"no\")","v":0},{"$f":"COUNTIF('Oct-Raw'!AX:AX,\"no\")","v":0},{"$f":"COUNTIF('Oct-Raw'!AZ:AZ,\"no\")","v":0},{"$f":"COUNTIF('Oct-Raw'!BB:BB,\"no\")","v":0},{"$f":"COUNTIF('Oct-Raw'!BD:BD,\"no\")","v":0},{"$f":"COUNTIF('Oct-Raw'!BF:BF,\"no\")","v":0},{"$f":"COUNTIF('Oct-Raw'!BH:BH,\"no\")","v":0},{"$f":"COUNTIF('Oct-Raw'!BJ:BJ,\"no\")","v":0},{"$f":"COUNTIF('Oct-Raw'!BL:BL,\"no\")","v":0},{"$f":"COUNTIF('Oct-Raw'!BN:BN,\"no\")","v":0},{"$f":"COUNTIF('Oct-Raw'!BP:BP,\"no\")","v":0},{"$f":"COUNTIF('Oct-Raw'!BR:BR,\"no\")","v":0},{"$f":"COUNTIF('Oct-Raw'!BT:BT,\"no\")","v":0},{"$f":"COUNTIF('Oct-Raw'!BV:BV,\"no\")","v":0},{"$f":"COUNTIF('Oct-Raw'!BX:BX,\"no\")","v":0},{"$f":"COUNTIF('Oct-Raw'!BZ:BZ,\"no\")","v":0},{"$f":"COUNTIF('Oct-Raw'!CB:CB,\"no\")","v":0},{"$f":"COUNTIF('Oct-Raw'!CD:CD,\"no\")","v":0},{"$f":"COUNTIF('Oct-Raw'!CF:CF,\"no\")","v":0},{"$f":"COUNTIF('Oct-Raw'!CH:CH,\"no\")","v":0}]
["Total Justified",{"$f":"COUNTIF('Oct-Raw'!H:H,\"Justified\")","v":0},{"$f":"COUNTIF('Oct-Raw'!J:J,\"Justified\")","v":0},{"$f":"COUNTIF('Oct-Raw'!L:L,\"Justified\")","v":0},{"$f":"COUNTIF('Oct-Raw'!N:N,\"Justified\")","v":0},{"$f":"COUNTIF('Oct-Raw'!P:P,\"Justified\")","v":0},{"$f":"COUNTIF('Oct-Raw'!R:R,\"Justified\")","v":0},{"$f":"COUNTIF('Oct-Raw'!T:T,\"Justified\")","v":0},{"$f":"COUNTIF('Oct-Raw'!V:V,\"Justified\")","v":0},{"$f":"COUNTIF('Oct-Raw'!X:X,\"Justified\")","v":1},{"$f":"COUNTIF('Oct-Raw'!Z:Z,\"Justified\")","v":0},{"$f":"COUNTIF('Oct-Raw'!AB:AB,\"Justified\")","v":0},{"$f":"COUNTIF('Oct-Raw'!AD:AD,\"Justified\")","v":0},{"$f":"COUNTIF('Oct-Raw'!AF:AF,\"Justified\")","v":0},{"$f":"COUNTIF('Oct-Raw'!AH:AH,\"Justified\")","v":0},{"$f":"COUNTIF('Oct-Raw'!AJ:AJ,\"Justified\")","v":0},{"$f":"COUNTIF('Oct-Raw'!AL:AL,\"Justified\")","v":0},{"$f":"COUNTIF('Oct-Raw'!AN:AN,\"Justified\")","v":0},{"$f":"COUNTIF('Oct-Raw'!AP:AP,\"Justified\")","v":0},{"$f":"COUNTIF('Oct-Raw'!AR:AR,\"Justified\")","v":0},{"$f":"COUNTIF('Oct-Raw'!AT:AT,\"Justified\")","v":0},{"$f":"COUNTIF('Oct-Raw'!AV:AV,\"Justified\")","v":0},{"$f":"COUNTIF('Oct-Raw'!AX:AX,\"Justified\")","v":0},{"$f":"COUNTIF('Oct-Raw'!AZ:AZ,\"Justified\")","v":0},{"$f":"COUNTIF('Oct-Raw'!BB:BB,\"Justified\")","v":0},{"$f":"COUNTIF('Oct-Raw'!BD:BD,\"Justified\")","v":0},{"$f":"COUNTIF('Oct-Raw'!BF:BF,\"Justified\")","v":0},{"$f":"COUNTIF('Oct-Raw'!BH:BH,\"Justified\")","v":0},{"$f":"COUNTIF('Oct-Raw'!BJ:BJ,\"Justified\")","v":0},{"$f":"COUNTIF('Oct-Raw'!BL:BL,\"Justified\")","v":0},{"$f":"COUNTIF('Oct-Raw'!BN:BN,\"Justified\")","v":0},{"$f":"COUNTIF('Oct-Raw'!BP:BP,\"Justified\")","v":0},{"$f":"COUNTIF('Oct-Raw'!BR:BR,\"Justified\")","v":0},{"$f":"COUNTIF('Oct-Raw'!BT:BT,\"Justified\")","v":0},{"$f":"COUNTIF('Oct-Raw'!BV:BV,\"Justified\")","v":0},{"$f":"COUNTIF('Oct-Raw'!BX:BX,\"Justified\")","v":0},{"$f":"COUNTIF('Oct-Raw'!BZ:BZ,\"Justified\")","v":0},{"$f":"COUNTIF('Oct-Raw'!CB:CB,\"Justified\")","v":0},{"$f":"COUNTIF('Oct-Raw'!CD:CD,\"Justified\")","v":0},{"$f":"COUNTIF('Oct-Raw'!CF:CF,\"Justified\")","v":0},{"$f":"COUNTIF('Oct-Raw'!CH:CH,\"Justified\")","v":0}]
["Total NA",{"$f":"COUNTIF('Oct-Raw'!H:H,\"NA\")","v":0},{"$f":"COUNTIF('Oct-Raw'!J:J,\"NA\")","v":0},{"$f":"COUNTIF('Oct-Raw'!L:L,\"NA\")","v":0},{"$f":"COUNTIF('Oct-Raw'!N:N,\"NA\")","v":0},{"$f":"COUNTIF('Oct-Raw'!P:P,\"NA\")","v":0},{"$f":"COUNTIF('Oct-Raw'!R:R,\"NA\")","v":0},{"$f":"COUNTIF('Oct-Raw'!T:T,\"NA\")","v":0},{"$f":"COUNTIF('Oct-Raw'!V:V,\"NA\")","v":0},{"$f":"COUNTIF('Oct-Raw'!X:X,\"NA\")","v":0},{"$f":"COUNTIF('Oct-Raw'!Z:Z,\"NA\")","v":0},{"$f":"COUNTIF('Oct-Raw'!AB:AB,\"NA\")","v":0},{"$f":"COUNTIF('Oct-Raw'!AD:AD,\"NA\")","v":0},{"$f":"COUNTIF('Oct-Raw'!AF:AF,\"NA\")","v":0},{"$f":"COUNTIF('Oct-Raw'!AH:AH,\"NA\")","v":0},{"$f":"COUNTIF('Oct-Raw'!AJ:AJ,\"NA\")","v":0},{"$f":"COUNTIF('Oct-Raw'!AL:AL,\"NA\")","v":0},{"$f":"COUNTIF('Oct-Raw'!AN:AN,\"NA\")","v":0},{"$f":"COUNTIF('Oct-Raw'!AP:AP,\"NA\")","v":0},{"$f":"COUNTIF('Oct-Raw'!AR:AR,\"NA\")","v":0},{"$f":"COUNTIF('Oct-Raw'!AT:AT,\"NA\")","v":0},{"$f":"COUNTIF('Oct-Raw'!AV:AV,\"NA\")","v":0},{"$f":"COUNTIF('Oct-Raw'!AX:AX,\"NA\")","v":0},{"$f":"COUNTIF('Oct-Raw'!AZ:AZ,\"NA\")","v":0},{"$f":"COUNTIF('Oct-Raw'!BB:BB,\"NA\")","v":0},{"$f":"COUNTIF('Oct-Raw'!BD:BD,\"NA\")","v":0},{"$f":"COUNTIF('Oct-Raw'!BF:BF,\"NA\")","v":0},{"$f":"COUNTIF('Oct-Raw'!BH:BH,\"NA\")","v":0},{"$f":"COUNTIF('Oct-Raw'!BJ:BJ,\"NA\")","v":0},{"$f":"COUNTIF('Oct-Raw'!BL:BL,\"NA\")","v":0},{"$f":"COUNTIF('Oct-Raw'!BN:BN,\"NA\")","v":0},{"$f":"COUNTIF('Oct-Raw'!BP:BP,\"NA\")","v":0},{"$f":"COUNTIF('Oct-Raw'!BR:BR,\"NA\")","v":0},{"$f":"COUNTIF('Oct-Raw'!BT:BT,\"NA\")","v":0},{"$f":"COUNTIF('Oct-Raw'!BV:BV,\"NA\")","v":0},{"$f":"COUNTIF('Oct-Raw'!BX:BX,\"NA\")","v":0},{"$f":"COUNTIF('Oct-Raw'!BZ:BZ,\"NA\")","v":0},{"$f":"COUNTIF('Oct-Raw'!CB:CB,\"NA\")","v":0},{"$f":"COUNTIF('Oct-Raw'!CD:CD,\"NA\")","v":0},{"$f":"COUNTIF('Oct-Raw'!CF:CF,\"NA\")","v":0},{"$f":"COUNTIF('Oct-Raw'!CH:CH,\"NA\")","v":0}]
["Blanks",{"$f":"B8-(SUM(B3:B6))","v":0},{"$f":"C8-(SUM(C3:C6))","v":0},0,0,0,0,0,0,0,0,0,3,3,3,3,3,3,3,3,3,3,3,3,3,3,3,3,3,3,3,3,3,3,3,3,3,3,3,3,3]
["full sample size",{"$f":"COUNTA('Oct-Raw'!A:A)-2","v":3},{"$f":"B8","v":3},3,3,3,3,3,3,3,3,3,3,3,3,3,3,3,3,3,3,3,3,3,3,3,3,3,3,3,3,3,3,3,3,3,3,3,3,3,3]
["True sample size (-NA + blanks)",{"$f":"IF(ISERROR(B8-(B6+B7)),\"\",B8-(B6+B7))","v":3},{"$f":"IF(ISERROR(C8-(C6+C7)),\"\",C8-(C6+C7))","v":3},3,3,3,3,3,3,3,3,3,0,0,0,0,0,0,0,0,0,0,0,0,0,0,0,0,0,0,0,0,0,0,0,0,0,0,0,0,0]
["%Y",{"$f":"IF(ISERROR(B3/B9),\"\",B3/B9)","v":1},{"$f":"IF(ISERROR(C3/C9),\"\",C3/C9)","v":1},1,1,1,1,1,1,0.66666666666666663,1,1,"","","","","","","","","","","","","","","","","","","","","","","","","","","","",""]
["%N",{"$f":"IF(ISERROR(B4/B9),\"\",B4/B9)","v":0},{"$f":"IF(ISERROR(C4/C9),\"\",C4/C9)","v":0},0,0,0,0,0,0,0,0,0,"","","","","","","","","","","","","","","","","","","","","","","","","","","","",""]
["%N - Justified",{"$f":"IF(ISERROR(B5/B9),\"\",B5/B9)","v":0},{"$f":"IF(ISERROR(C5/C9),\"\",C5/C9)","v":0},0,0,0,0,0,0,0.33333333333333331,0,0,"","","","","","","","","","","","","","","","","","","","","","","","","","","","",""]

{"sheet":"Nov","index":27,"n_rows":51,"n_cols":8,"rows_kept":51,"cut":false,"hidden":false,"merged":[]}
["Click here to go to year overview"]
[]
["Date",null,null,"Total by Apt type"]
["Completed by",null,null,"New",{"$f":"COUNTIF('Apr-Raw'!E3:E103,\"New\")","v":5}]
["Sample group size",{"$f":"COUNTA('Nov-Raw'!A:A)-2","v":4},null,"Follow up",{"$f":"COUNTIF('Nov-Raw'!E3:E103,\"Fup\")","v":0},null,null,{"$f":"Year!H5","v":0.95}]
["Overall Result (compliant only)",{"$f":"IF(ISERROR(SUM(D11:D50)/G51),\"\",SUM(D11:D50)/G51)","v":0.86363636363636365},null,"Total by apt Code",null,null,null,{"$f":"Year!H6","v":"80-95%"}]
["Overall Result (compliant & Justified)",{"$f":"IF(ISERROR(SUM(C11:C50)/G51),\"\",SUM(C11:C50)/G51)","v":0.97727272727272729},null,"code goes in here",{"$f":"COUNTIF('Nov-Raw'!F3:F103,D7)","v":0},null,null,{"$f":"Year!H7","v":0.8}]
["viable qs",{"$f":"G51","v":11}]
[]
["Metric","Target %","Compliant + Justified","Compliant","Justified","Not compliant","Irritating math"]
[{"$f":"IF(ISERROR(Q!A2),\"\",Q!A2)","v":"Was a Room number documented?"},{"$f":"IF(ISERROR(Q!B2),\"\",Q!B2)","v":0},{"$f":"IF(ISERROR(D11+E11),\"\",D11+E11)","v":1},{"$f":"'Nov-Data'!B10","v":1},{"$f":"'Nov-Data'!B12","v":0},{"$f":"'Nov-Data'!B11","v":0},{"$f":"COUNTIF(D11:F11,\">0\")","v":1}]
[{"$f":"IF(ISERROR(Q!A3),\"\",Q!A3)","v":"Were stage A checks completed as appropriate?"},{"$f":"IF(ISERROR(Q!B3),\"\",Q!B3)","v":0},1,{"$f":"'Nov-Data'!C10","v":1},{"$f":"'Nov-Data'!C12","v":0},{"$f":"'Nov-Data'!C11","v":0},1]
[{"$f":"IF(ISERROR(Q!A4),\"\",Q!A4)","v":"Was COSI Part 1 performed?"},{"$f":"IF(ISERROR(Q!B4),\"\",Q!B4)","v":0},1,{"$f":"'Nov-Data'!D10","v":1},{"$f":"'Nov-Data'!D12","v":0},{"$f":"'Nov-Data'!D11","v":0},1]
[{"$f":"IF(ISERROR(Q!A5),\"\",Q!A5)","v":"Was PVP documented?"},{"$f":"IF(ISERROR(Q!B5),\"\",Q!B5)","v":0},1,{"$f":"'Nov-Data'!E10","v":1},{"$f":"'Nov-Data'!E12","v":0},{"$f":"'Nov-Data'!E11","v":0},1]
[{"$f":"IF(ISERROR(Q!A6),\"\",Q!A6)","v":"Was Otoscopy documented?"},{"$f":"IF(ISERROR(Q!B6),\"\",Q!B6)","v":0},0.75,{"$f":"'Nov-Data'!F10","v":0.75},{"$f":"'Nov-Data'!F12","v":0},{"$f":"'Nov-Data'!F11","v":0.25},2]
[{"$f":"IF(ISERROR(Q!A7),\"\",Q!A7)","v":"Document bc at 3 & 4kHz is for programming purposes?"},{"$f":"IF(ISERROR(Q!B7),\"\",Q!B7)","v":0},1,{"$f":"'Nov-Data'!G10","v":1},{"$f":"'Nov-Data'!G12","v":0},{"$f":"'Nov-Data'!G11","v":0},1]
[{"$f":"IF(ISERROR(Q!A8),\"\",Q!A8)","v":"Was Speech testing performed?"},{"$f":"IF(ISERROR(Q!B8),\"\",Q!B8)","v":0},1,{"$f":"'Nov-Data'!H10","v":0.5},{"$f":"'Nov-Data'!H12","v":0.5},{"$f":"'Nov-Data'!H11","v":0},2]
[{"$f":"IF(ISERROR(Q!A9),\"\",Q!A9)","v":"Is it documented whether national criteria were/were not met?"},{"$f":"IF(ISERROR(Q!B9),\"\",Q!B9)","v":0},1,{"$f":"'Nov-Data'!I10","v":0.75},{"$f":"'Nov-Data'!I12","v":0.25},{"$f":"'Nov-Data'!I11","v":0},2]
[{"$f":"IF(ISERROR(Q!A10),\"\",Q!A10)","v":"Was a BCHI info pack supplied?"},{"$f":"IF(ISERROR(Q!B10),\"\",Q!B10)","v":0},1,{"$f":"'Nov-Data'!J10","v":0.5},{"$f":"'Nov-Data'!J12","v":0.5},{"$f":"'Nov-Data'!J11","v":0},2]
[{"$f":"IF(ISERROR(Q!A11),\"\",Q!A11)","v":"Was the report authorised & issued within target (7 days)?"},{"$f":"IF(ISERROR(Q!B11),\"\",Q!B11)","v":0},1,{"$f":"'Nov-Data'!K10","v":1},{"$f":"'Nov-Data'!K12","v":0},{"$f":"'Nov-Data'!K11","v":0},1]
[{"$f":"IF(ISERROR(Q!A12),\"\",Q!A12)","v":"Was consent documented as appropriate?"},{"$f":"IF(ISERROR(Q!B12),\"\",Q!B12)","v":0},1,{"$f":"'Nov-Data'!L10","v":1},{"$f":"'Nov-Data'!L12","v":0},{"$f":"'Nov-Data'!L11","v":0},1]
[{"$f":"IF(ISERROR(Q!A13),\"\",Q!A13)","v":0},{"$f":"IF(ISERROR(Q!B13),\"\",Q!B13)","v":0},"",{"$f":"'Nov-Data'!M10","v":""},{"$f":"'Nov-Data'!M12","v":""},{"$f":"'Nov-Data'!M11","v":""},0]
[{"$f":"IF(ISERROR(Q!A14),\"\",Q!A14)","v":0},{"$f":"IF(ISERROR(Q!B14),\"\",Q!B14)","v":0},"",{"$f":"'Nov-Data'!N10","v":""},{"$f":"'Nov-Data'!N12","v":""},{"$f":"'Nov-Data'!N11","v":""},0]
[{"$f":"IF(ISERROR(Q!A15),\"\",Q!A15)","v":0},{"$f":"IF(ISERROR(Q!B15),\"\",Q!B15)","v":0},"",{"$f":"'Nov-Data'!O10","v":""},{"$f":"'Nov-Data'!O12","v":""},{"$f":"'Nov-Data'!O11","v":""},0]
[{"$f":"IF(ISERROR(Q!A16),\"\",Q!A16)","v":0},{"$f":"IF(ISERROR(Q!B16),\"\",Q!B16)","v":0},"",{"$f":"'Nov-Data'!P10","v":""},{"$f":"'Nov-Data'!P12","v":""},{"$f":"'Nov-Data'!P11","v":""},0]
[{"$f":"IF(ISERROR(Q!A17),\"\",Q!A17)","v":0},{"$f":"IF(ISERROR(Q!B17),\"\",Q!B17)","v":0},"",{"$f":"'Nov-Data'!Q10","v":""},{"$f":"'Nov-Data'!Q12","v":""},{"$f":"'Nov-Data'!Q11","v":""},0]
[{"$f":"IF(ISERROR(Q!A18),\"\",Q!A18)","v":0},{"$f":"IF(ISERROR(Q!B18),\"\",Q!B18)","v":0},"",{"$f":"'Nov-Data'!R10","v":""},{"$f":"'Nov-Data'!R12","v":""},{"$f":"'Nov-Data'!R11","v":""},0]
[{"$f":"IF(ISERROR(Q!A19),\"\",Q!A19)","v":0},{"$f":"IF(ISERROR(Q!B19),\"\",Q!B19)","v":0},"",{"$f":"'Nov-Data'!S10","v":""},{"$f":"'Nov-Data'!S12","v":""},{"$f":"'Nov-Data'!S11","v":""},0]
[{"$f":"IF(ISERROR(Q!A20),\"\",Q!A20)","v":0},{"$f":"IF(ISERROR(Q!B20),\"\",Q!B20)","v":0},"",{"$f":"'Nov-Data'!T10","v":""},{"$f":"'Nov-Data'!T12","v":""},{"$f":"'Nov-Data'!T11","v":""},0]
[{"$f":"IF(ISERROR(Q!A21),\"\",Q!A21)","v":0},{"$f":"IF(ISERROR(Q!B21),\"\",Q!B21)","v":0},"",{"$f":"'Nov-Data'!U10","v":""},{"$f":"'Nov-Data'!U12","v":""},{"$f":"'Nov-Data'!U11","v":""},0]
[{"$f":"IF(ISERROR(Q!A22),\"\",Q!A22)","v":0},{"$f":"IF(ISERROR(Q!B22),\"\",Q!B22)","v":0},"",{"$f":"'Nov-Data'!V10","v":""},{"$f":"'Nov-Data'!V12","v":""},{"$f":"'Nov-Data'!V11","v":""},0]
[{"$f":"IF(ISERROR(Q!A23),\"\",Q!A23)","v":0},{"$f":"IF(ISERROR(Q!B23),\"\",Q!B23)","v":0},"",{"$f":"'Nov-Data'!W10","v":""},{"$f":"'Nov-Data'!W12","v":""},{"$f":"'Nov-Data'!W11","v":""},0]
[{"$f":"IF(ISERROR(Q!A24),\"\",Q!A24)","v":0},{"$f":"IF(ISERROR(Q!B24),\"\",Q!B24)","v":0},"",{"$f":"'Nov-Data'!X10","v":""},{"$f":"'Nov-Data'!X12","v":""},{"$f":"'Nov-Data'!X11","v":""},0]
[{"$f":"IF(ISERROR(Q!A25),\"\",Q!A25)","v":0},{"$f":"IF(ISERROR(Q!B25),\"\",Q!B25)","v":0},"",{"$f":"'Nov-Data'!Y10","v":""},{"$f":"'Nov-Data'!Y12","v":""},{"$f":"'Nov-Data'!Y11","v":""},0]
[{"$f":"IF(ISERROR(Q!A26),\"\",Q!A26)","v":0},{"$f":"IF(ISERROR(Q!B26),\"\",Q!B26)","v":0},"",{"$f":"'Nov-Data'!Z10","v":""},{"$f":"'Nov-Data'!Z12","v":""},{"$f":"'Nov-Data'!Z11","v":""},0]
[{"$f":"IF(ISERROR(Q!A27),\"\",Q!A27)","v":0},{"$f":"IF(ISERROR(Q!B27),\"\",Q!B27)","v":0},"",{"$f":"'Nov-Data'!AA10","v":""},{"$f":"'Nov-Data'!AA12","v":""},{"$f":"'Nov-Data'!AA11","v":""},0]
[{"$f":"IF(ISERROR(Q!A28),\"\",Q!A28)","v":0},{"$f":"IF(ISERROR(Q!B28),\"\",Q!B28)","v":0},"",{"$f":"'Nov-Data'!AB10","v":""},{"$f":"'Nov-Data'!AB12","v":""},{"$f":"'Nov-Data'!AB11","v":""},0]
[{"$f":"IF(ISERROR(Q!A29),\"\",Q!A29)","v":0},{"$f":"IF(ISERROR(Q!B29),\"\",Q!B29)","v":0},"",{"$f":"'Nov-Data'!AC10","v":""},{"$f":"'Nov-Data'!AC12","v":""},{"$f":"'Nov-Data'!AC11","v":""},0]
[{"$f":"IF(ISERROR(Q!A30),\"\",Q!A30)","v":0},{"$f":"IF(ISERROR(Q!B30),\"\",Q!B30)","v":0},"",{"$f":"'Nov-Data'!AD10","v":""},{"$f":"'Nov-Data'!AD12","v":""},{"$f":"'Nov-Data'!AD11","v":""},0]
[{"$f":"IF(ISERROR(Q!A31),\"\",Q!A31)","v":0},{"$f":"IF(ISERROR(Q!B31),\"\",Q!B31)","v":0},"",{"$f":"'Nov-Data'!AE10","v":""},{"$f":"'Nov-Data'!AE12","v":""},{"$f":"'Nov-Data'!AE11","v":""},0]
[{"$f":"IF(ISERROR(Q!A32),\"\",Q!A32)","v":0},{"$f":"IF(ISERROR(Q!B32),\"\",Q!B32)","v":0},"",{"$f":"'Nov-Data'!AF10","v":""},{"$f":"'Nov-Data'!AF12","v":""},{"$f":"'Nov-Data'!AF11","v":""},0]
[{"$f":"IF(ISERROR(Q!A33),\"\",Q!A33)","v":0},{"$f":"IF(ISERROR(Q!B33),\"\",Q!B33)","v":0},"",{"$f":"'Nov-Data'!AG10","v":""},{"$f":"'Nov-Data'!AG12","v":""},{"$f":"'Nov-Data'!AG11","v":""},0]
[{"$f":"IF(ISERROR(Q!A34),\"\",Q!A34)","v":0},{"$f":"IF(ISERROR(Q!B34),\"\",Q!B34)","v":0},"",{"$f":"'Nov-Data'!AH10","v":""},{"$f":"'Nov-Data'!AH12","v":""},{"$f":"'Nov-Data'!AH11","v":""},0]
[{"$f":"IF(ISERROR(Q!A35),\"\",Q!A35)","v":0},{"$f":"IF(ISERROR(Q!B35),\"\",Q!B35)","v":0},"",{"$f":"'Nov-Data'!AI10","v":""},{"$f":"'Nov-Data'!AI12","v":""},{"$f":"'Nov-Data'!AI11","v":""},0]
[{"$f":"IF(ISERROR(Q!A36),\"\",Q!A36)","v":0},{"$f":"IF(ISERROR(Q!B36),\"\",Q!B36)","v":0},"",{"$f":"'Nov-Data'!AJ10","v":""},{"$f":"'Nov-Data'!AJ12","v":""},{"$f":"'Nov-Data'!AJ11","v":""},0]
[{"$f":"IF(ISERROR(Q!A37),\"\",Q!A37)","v":0},{"$f":"IF(ISERROR(Q!B37),\"\",Q!B37)","v":0},"",{"$f":"'Nov-Data'!AK10","v":""},{"$f":"'Nov-Data'!AK12","v":""},{"$f":"'Nov-Data'!AK11","v":""},0]
[{"$f":"IF(ISERROR(Q!A38),\"\",Q!A38)","v":0},{"$f":"IF(ISERROR(Q!B38),\"\",Q!B38)","v":0},"",{"$f":"'Nov-Data'!AL10","v":""},{"$f":"'Nov-Data'!AL12","v":""},{"$f":"'Nov-Data'!AL11","v":""},0]
[{"$f":"IF(ISERROR(Q!A39),\"\",Q!A39)","v":0},{"$f":"IF(ISERROR(Q!B39),\"\",Q!B39)","v":0},"",{"$f":"'Nov-Data'!AM10","v":""},{"$f":"'Nov-Data'!AM12","v":""},{"$f":"'Nov-Data'!AM11","v":""},0]
[{"$f":"IF(ISERROR(Q!A40),\"\",Q!A40)","v":0},{"$f":"IF(ISERROR(Q!B40),\"\",Q!B40)","v":0},"",{"$f":"'Nov-Data'!AN10","v":""},{"$f":"'Nov-Data'!AN12","v":""},{"$f":"'Nov-Data'!AN11","v":""},0]
[{"$f":"IF(ISERROR(Q!A41),\"\",Q!A41)","v":0},{"$f":"IF(ISERROR(Q!B41),\"\",Q!B41)","v":0},"",{"$f":"'Nov-Data'!AO10","v":""},{"$f":"'Nov-Data'!AO12","v":""},{"$f":"'Nov-Data'!AO11","v":""},0]
[null,null,null,null,null,null,{"$f":"COUNTIF(G11:G50,\">=1\")","v":11}]

{"sheet":"Nov-Raw","index":28,"n_rows":6,"n_cols":87,"rows_kept":6,"cut":false,"hidden":true,"merged":[[0,85,0,86],[0,63,0,64],[0,65,0,66],[0,67,0,68],[0,69,0,70],[0,71,0,72],[0,73,0,74],[0,75,0,76],[0,77,0,78],[0,79,0,80],[0,81,0,82],[0,83,0,84],[0,61,0,62],[0,39,0,40],[0,41,0,42],[0,43,0,44],[0,45,0,46],[0,47,0,48],[0,49,0,50],[0,51,0,52],[0,53,0,54],[0,55,0,56],[0,57,0,58],[0,59,0,60],[0,37,0,38],[0,15,0,16],[0,17,0,18],[0,19,0,20],[0,21,0,22],[0,23,0,24],[0,25,0,26],[0,27,0,28],[0,29,0,30],[0,31,0,32],[0,33,0,34],[0,35,0,36],[0,13,0,14],[0,0,0,5],[0,6,1,6],[0,7,0,8],[0,9,0,10],[0,11,0,12]]}
["Record details",null,null,null,null,null,"Notes",{"$f":"Q!A2","v":"Was a Room number documented?"},null,{"$f":"Q!A3","v":"Were stage A checks completed as appropriate?"},null,{"$f":"Q!A4","v":"Was COSI Part 1 performed?"},null,{"$f":"Q!A5","v":"Was PVP documented?"},null,{"$f":"Q!A6","v":"Was Otoscopy documented?"},null,{"$f":"Q!A7","v":"Document bc at 3 & 4kHz is for programming purposes?"},null,{"$f":"Q!A8","v":"Was Speech testing performed?"},null,{"$f":"Q!A9","v":"Is it documented whether national criteria were/were not met?"},null,{"$f":"Q!A10","v":"Was a BCHI info pack supplied?"},null,{"$f":"Q!A11","v":"Was the report authorised & issued within target (7 days)?"},null,{"$f":"Q!A12","v":"Was consent documented as appropriate?"},null,{"$f":"Q!A13","v":0},null,{"$f":"Q!A14","v":0},null,{"$f":"Q!A15","v":0},null,{"$f":"Q!A16","v":0},null,{"$f":"Q!A17","v":0},null,{"$f":"Q!A18","v":0},null,{"$f":"Q!A19","v":0},null,{"$f":"Q!A20","v":0},null,{"$f":"Q!A21","v":0},null,{"$f":"Q!A22","v":0},null,{"$f":"Q!A23","v":0},null,{"$f":"Q!A24","v":0},null,{"$f":"Q!A25","v":0},null,{"$f":"Q!A26","v":0},null,{"$f":"Q!A27","v":0},null,{"$f":"Q!A28","v":0},null,{"$f":"Q!A29","v":0},null,{"$f":"Q!A30","v":0},null,{"$f":"Q!A31","v":0},null,{"$f":"Q!A32","v":0},null,{"$f":"Q!A33","v":0},null,{"$f":"Q!A34","v":0},null,{"$f":"Q!A35","v":0},null,{"$f":"Q!A36","v":0},null,{"$f":"Q!A37","v":0},null,{"$f":"Q!A38","v":0},null,{"$f":"Q!A39","v":0},null,{"$f":"Q!A40","v":0},null,{"$f":"Q!A41","v":0}]
["Pt number","Date seen","Clinician 1","clinician 2","New/ F-up","Apt code",null,"Compliant?","Other result","Compliant?","Other result","Compliant?","Other result","Compliant?","Other result","Compliant?","Other result","Compliant?","Other result","Compliant?","Other result","Compliant?","Other result","Compliant?","Other result","Compliant?","Other result","Compliant?","Other result","Compliant?","Other result","Compliant?","Other result","Compliant?","Other result","Compliant?","Other result","Compliant?","Other result","Compliant?","Other result","Compliant?","Other result","Compliant?","Other result","Compliant?","Other result","Compliant?","Other result","Compliant?","Other result","Compliant?","Other result","Compliant?","Other result","Compliant?","Other result","Compliant?","Other result","Compliant?","Other result","Compliant?","Other result","Compliant?","Other result","Compliant?","Other result","Compliant?","Other result","Compliant?","Other result","Compliant?","Other result","Compliant?","Other result","Compliant?","Other result","Compliant?","Other result","Compliant?","Other result","Compliant?","Other result","Compliant?","Other result","Compliant?","Other result"]
["AB0001","2023-11-11","AA",null,"New","BA",null,"Yes",null,"Yes",null,"Yes",null,"Yes",null,"Yes",null,"Yes",null,"Yes",null,"Yes",null,"Yes",null,"Yes",null,"Yes"]
["AB0002","2023-11-17","AA",null,"New","BA",null,"Yes",null,"Yes",null,"Yes",null,"Yes",null,"Yes",null,"Yes",null,"Justified","BCHI testing abandoned as pt wanted to revisit grommet insertion option","Justified","As above","Justified","As above","Yes",null,"Yes"]
["AB0003","2023-11-24","BB",null,"New","BA",null,"Yes",null,"Yes",null,"Yes",null,"Yes",null,"Yes",null,"Yes",null,"Justified","BCHI testing abandoned - no conductive element","Yes",null,"Justified","As above","Yes",null,"Yes"]
["AB0004","2023-11-26","BB",null,"New","BA",null,"Yes",null,"Yes",null,"Yes",null,"Yes",null,"No",null,"Yes",null,"Yes",null,"Yes",null,"Yes",null,"Yes",null,"Yes"]

{"sheet":"Nov-Data","index":29,"n_rows":12,"n_cols":41,"rows_kept":12,"cut":false,"hidden":true,"merged":[[0,0,1,0]]}
["Results",{"$f":"Q!A2","v":"Was a Room number documented?"},{"$f":"Q!A3","v":"Were stage A checks completed as appropriate?"},{"$f":"Q!A4","v":"Was COSI Part 1 performed?"},{"$f":"Q!A5","v":"Was PVP documented?"},{"$f":"Q!A6","v":"Was Otoscopy documented?"},{"$f":"Q!A7","v":"Document bc at 3 & 4kHz is for programming purposes?"},{"$f":"Q!A8","v":"Was Speech testing performed?"},{"$f":"Q!A9","v":"Is it documented whether national criteria were/were not met?"},{"$f":"Q!A10","v":"Was a BCHI info pack supplied?"},{"$f":"Q!A11","v":"Was the report authorised & issued within target (7 days)?"},{"$f":"Q!A12","v":"Was consent documented as appropriate?"},{"$f":"Q!A13","v":0},{"$f":"Q!A14","v":0},{"$f":"Q!A15","v":0},{"$f":"Q!A16","v":0},{"$f":"Q!A17","v":0},{"$f":"Q!A18","v":0},{"$f":"Q!A19","v":0},{"$f":"Q!A20","v":0},{"$f":"Q!A21","v":0},{"$f":"Q!A22","v":0},{"$f":"Q!A23","v":0},{"$f":"Q!A24","v":0},{"$f":"Q!A25","v":0},{"$f":"Q!A26","v":0},{"$f":"Q!A27","v":0},{"$f":"Q!A28","v":0},{"$f":"Q!A29","v":0},{"$f":"Q!A30","v":0},{"$f":"Q!A31","v":0},{"$f":"Q!A32","v":0},{"$f":"Q!A33","v":0},{"$f":"Q!A34","v":0},{"$f":"Q!A35","v":0},{"$f":"Q!A36","v":0},{"$f":"Q!A37","v":0},{"$f":"Q!A38","v":0},{"$f":"Q!A39","v":0},{"$f":"Q!A40","v":0},{"$f":"Q!A41","v":0}]
[null,"Compliant?","Compliant?","Compliant?","Compliant?","Compliant?","Compliant?","Compliant?","Compliant?","Compliant?","Compliant?","Compliant?","Compliant?","Compliant?","Compliant?","Compliant?","Compliant?","Compliant?","Compliant?","Compliant?","Compliant?","Compliant?","Compliant?","Compliant?","Compliant?","Compliant?","Compliant?","Compliant?","Compliant?","Compliant?","Compliant?","Compliant?","Compliant?","Compliant?","Compliant?","Compliant?","Compliant?","Compliant?","Compliant?","Compliant?","Compliant?"]
["Total Y",{"$f":"COUNTIF('Nov-Raw'!H:H,\"yes\")","v":4},{"$f":"COUNTIF('Nov-Raw'!J:J,\"yes\")","v":4},{"$f":"COUNTIF('Nov-Raw'!L:L,\"yes\")","v":4},{"$f":"COUNTIF('Nov-Raw'!N:N,\"yes\")","v":4},{"$f":"COUNTIF('Nov-Raw'!P:P,\"yes\")","v":3},{"$f":"COUNTIF('Nov-Raw'!R:R,\"yes\")","v":4},{"$f":"COUNTIF('Nov-Raw'!T:T,\"yes\")","v":2},{"$f":"COUNTIF('Nov-Raw'!V:V,\"yes\")","v":3},{"$f":"COUNTIF('Nov-Raw'!X:X,\"yes\")","v":2},{"$f":"COUNTIF('Nov-Raw'!Z:Z,\"yes\")","v":4},{"$f":"COUNTIF('Nov-Raw'!AB:AB,\"yes\")","v":4},{"$f":"COUNTIF('Nov-Raw'!AD:AD,\"yes\")","v":0},{"$f":"COUNTIF('Nov-Raw'!AF:AF,\"yes\")","v":0},{"$f":"COUNTIF('Nov-Raw'!AH:AH,\"yes\")","v":0},{"$f":"COUNTIF('Nov-Raw'!AJ:AJ,\"yes\")","v":0},{"$f":"COUNTIF('Nov-Raw'!AL:AL,\"yes\")","v":0},{"$f":"COUNTIF('Nov-Raw'!AN:AN,\"yes\")","v":0},{"$f":"COUNTIF('Nov-Raw'!AP:AP,\"yes\")","v":0},{"$f":"COUNTIF('Nov-Raw'!AR:AR,\"yes\")","v":0},{"$f":"COUNTIF('Nov-Raw'!AT:AT,\"yes\")","v":0},{"$f":"COUNTIF('Nov-Raw'!AV:AV,\"yes\")","v":0},{"$f":"COUNTIF('Nov-Raw'!AX:AX,\"yes\")","v":0},{"$f":"COUNTIF('Nov-Raw'!AZ:AZ,\"yes\")","v":0},{"$f":"COUNTIF('Nov-Raw'!BB:BB,\"yes\")","v":0},{"$f":"COUNTIF('Nov-Raw'!BD:BD,\"yes\")","v":0},{"$f":"COUNTIF('Nov-Raw'!BF:BF,\"yes\")","v":0},{"$f":"COUNTIF('Nov-Raw'!BH:BH,\"yes\")","v":0},{"$f":"COUNTIF('Nov-Raw'!BJ:BJ,\"yes\")","v":0},{"$f":"COUNTIF('Nov-Raw'!BL:BL,\"yes\")","v":0},{"$f":"COUNTIF('Nov-Raw'!BN:BN,\"yes\")","v":0},{"$f":"COUNTIF('Nov-Raw'!BP:BP,\"yes\")","v":0},{"$f":"COUNTIF('Nov-Raw'!BR:BR,\"yes\")","v":0},{"$f":"COUNTIF('Nov-Raw'!BT:BT,\"yes\")","v":0},{"$f":"COUNTIF('Nov-Raw'!BV:BV,\"yes\")","v":0},{"$f":"COUNTIF('Nov-Raw'!BX:BX,\"yes\")","v":0},{"$f":"COUNTIF('Nov-Raw'!BZ:BZ,\"yes\")","v":0},{"$f":"COUNTIF('Nov-Raw'!CB:CB,\"yes\")","v":0},{"$f":"COUNTIF('Nov-Raw'!CD:CD,\"yes\")","v":0},{"$f":"COUNTIF('Nov-Raw'!CF:CF,\"yes\")","v":0},{"$f":"COUNTIF('Nov-Raw'!CH:CH,\"yes\")","v":0}]
["Total N",{"$f":"COUNTIF('Nov-Raw'!H:H,\"no\")","v":0},{"$f":"COUNTIF('Nov-Raw'!J:J,\"no\")","v":0},{"$f":"COUNTIF('Nov-Raw'!L:L,\"no\")","v":0},{"$f":"COUNTIF('Nov-Raw'!N:N,\"no\")","v":0},{"$f":"COUNTIF('Nov-Raw'!P:P,\"no\")","v":1},{"$f":"COUNTIF('Nov-Raw'!R:R,\"no\")","v":0},{"$f":"COUNTIF('Nov-Raw'!T:T,\"no\")","v":0},{"$f":"COUNTIF('Nov-Raw'!V:V,\"no\")","v":0},{"$f":"COUNTIF('Nov-Raw'!X:X,\"no\")","v":0},{"$f":"COUNTIF('Nov-Raw'!Z:Z,\"no\")","v":0},{"$f":"COUNTIF('Nov-Raw'!AB:AB,\"no\")","v":0},{"$f":"COUNTIF('Nov-Raw'!AD:AD,\"no\")","v":0},{"$f":"COUNTIF('Nov-Raw'!AF:AF,\"no\")","v":0},{"$f":"COUNTIF('Nov-Raw'!AH:AH,\"no\")","v":0},{"$f":"COUNTIF('Nov-Raw'!AJ:AJ,\"no\")","v":0},{"$f":"COUNTIF('Nov-Raw'!AL:AL,\"no\")","v":0},{"$f":"COUNTIF('Nov-Raw'!AN:AN,\"no\")","v":0},{"$f":"COUNTIF('Nov-Raw'!AP:AP,\"no\")","v":0},{"$f":"COUNTIF('Nov-Raw'!AR:AR,\"no\")","v":0},{"$f":"COUNTIF('Nov-Raw'!AT:AT,\"no\")","v":0},{"$f":"COUNTIF('Nov-Raw'!AV:AV,\"no\")","v":0},{"$f":"COUNTIF('Nov-Raw'!AX:AX,\"no\")","v":0},{"$f":"COUNTIF('Nov-Raw'!AZ:AZ,\"no\")","v":0},{"$f":"COUNTIF('Nov-Raw'!BB:BB,\"no\")","v":0},{"$f":"COUNTIF('Nov-Raw'!BD:BD,\"no\")","v":0},{"$f":"COUNTIF('Nov-Raw'!BF:BF,\"no\")","v":0},{"$f":"COUNTIF('Nov-Raw'!BH:BH,\"no\")","v":0},{"$f":"COUNTIF('Nov-Raw'!BJ:BJ,\"no\")","v":0},{"$f":"COUNTIF('Nov-Raw'!BL:BL,\"no\")","v":0},{"$f":"COUNTIF('Nov-Raw'!BN:BN,\"no\")","v":0},{"$f":"COUNTIF('Nov-Raw'!BP:BP,\"no\")","v":0},{"$f":"COUNTIF('Nov-Raw'!BR:BR,\"no\")","v":0},{"$f":"COUNTIF('Nov-Raw'!BT:BT,\"no\")","v":0},{"$f":"COUNTIF('Nov-Raw'!BV:BV,\"no\")","v":0},{"$f":"COUNTIF('Nov-Raw'!BX:BX,\"no\")","v":0},{"$f":"COUNTIF('Nov-Raw'!BZ:BZ,\"no\")","v":0},{"$f":"COUNTIF('Nov-Raw'!CB:CB,\"no\")","v":0},{"$f":"COUNTIF('Nov-Raw'!CD:CD,\"no\")","v":0},{"$f":"COUNTIF('Nov-Raw'!CF:CF,\"no\")","v":0},{"$f":"COUNTIF('Nov-Raw'!CH:CH,\"no\")","v":0}]
["Total Justified",{"$f":"COUNTIF('Nov-Raw'!H:H,\"Justified\")","v":0},{"$f":"COUNTIF('Nov-Raw'!J:J,\"Justified\")","v":0},{"$f":"COUNTIF('Nov-Raw'!L:L,\"Justified\")","v":0},{"$f":"COUNTIF('Nov-Raw'!N:N,\"Justified\")","v":0},{"$f":"COUNTIF('Nov-Raw'!P:P,\"Justified\")","v":0},{"$f":"COUNTIF('Nov-Raw'!R:R,\"Justified\")","v":0},{"$f":"COUNTIF('Nov-Raw'!T:T,\"Justified\")","v":2},{"$f":"COUNTIF('Nov-Raw'!V:V,\"Justified\")","v":1},{"$f":"COUNTIF('Nov-Raw'!X:X,\"Justified\")","v":2},{"$f":"COUNTIF('Nov-Raw'!Z:Z,\"Justified\")","v":0},{"$f":"COUNTIF('Nov-Raw'!AB:AB,\"Justified\")","v":0},{"$f":"COUNTIF('Nov-Raw'!AD:AD,\"Justified\")","v":0},{"$f":"COUNTIF('Nov-Raw'!AF:AF,\"Justified\")","v":0},{"$f":"COUNTIF('Nov-Raw'!AH:AH,\"Justified\")","v":0},{"$f":"COUNTIF('Nov-Raw'!AJ:AJ,\"Justified\")","v":0},{"$f":"COUNTIF('Nov-Raw'!AL:AL,\"Justified\")","v":0},{"$f":"COUNTIF('Nov-Raw'!AN:AN,\"Justified\")","v":0},{"$f":"COUNTIF('Nov-Raw'!AP:AP,\"Justified\")","v":0},{"$f":"COUNTIF('Nov-Raw'!AR:AR,\"Justified\")","v":0},{"$f":"COUNTIF('Nov-Raw'!AT:AT,\"Justified\")","v":0},{"$f":"COUNTIF('Nov-Raw'!AV:AV,\"Justified\")","v":0},{"$f":"COUNTIF('Nov-Raw'!AX:AX,\"Justified\")","v":0},{"$f":"COUNTIF('Nov-Raw'!AZ:AZ,\"Justified\")","v":0},{"$f":"COUNTIF('Nov-Raw'!BB:BB,\"Justified\")","v":0},{"$f":"COUNTIF('Nov-Raw'!BD:BD,\"Justified\")","v":0},{"$f":"COUNTIF('Nov-Raw'!BF:BF,\"Justified\")","v":0},{"$f":"COUNTIF('Nov-Raw'!BH:BH,\"Justified\")","v":0},{"$f":"COUNTIF('Nov-Raw'!BJ:BJ,\"Justified\")","v":0},{"$f":"COUNTIF('Nov-Raw'!BL:BL,\"Justified\")","v":0},{"$f":"COUNTIF('Nov-Raw'!BN:BN,\"Justified\")","v":0},{"$f":"COUNTIF('Nov-Raw'!BP:BP,\"Justified\")","v":0},{"$f":"COUNTIF('Nov-Raw'!BR:BR,\"Justified\")","v":0},{"$f":"COUNTIF('Nov-Raw'!BT:BT,\"Justified\")","v":0},{"$f":"COUNTIF('Nov-Raw'!BV:BV,\"Justified\")","v":0},{"$f":"COUNTIF('Nov-Raw'!BX:BX,\"Justified\")","v":0},{"$f":"COUNTIF('Nov-Raw'!BZ:BZ,\"Justified\")","v":0},{"$f":"COUNTIF('Nov-Raw'!CB:CB,\"Justified\")","v":0},{"$f":"COUNTIF('Nov-Raw'!CD:CD,\"Justified\")","v":0},{"$f":"COUNTIF('Nov-Raw'!CF:CF,\"Justified\")","v":0},{"$f":"COUNTIF('Nov-Raw'!CH:CH,\"Justified\")","v":0}]
["Total NA",{"$f":"COUNTIF('Nov-Raw'!H:H,\"NA\")","v":0},{"$f":"COUNTIF('Nov-Raw'!J:J,\"NA\")","v":0},{"$f":"COUNTIF('Nov-Raw'!L:L,\"NA\")","v":0},{"$f":"COUNTIF('Nov-Raw'!N:N,\"NA\")","v":0},{"$f":"COUNTIF('Nov-Raw'!P:P,\"NA\")","v":0},{"$f":"COUNTIF('Nov-Raw'!R:R,\"NA\")","v":0},{"$f":"COUNTIF('Nov-Raw'!T:T,\"NA\")","v":0},{"$f":"COUNTIF('Nov-Raw'!V:V,\"NA\")","v":0},{"$f":"COUNTIF('Nov-Raw'!X:X,\"NA\")","v":0},{"$f":"COUNTIF('Nov-Raw'!Z:Z,\"NA\")","v":0},{"$f":"COUNTIF('Nov-Raw'!AB:AB,\"NA\")","v":0},{"$f":"COUNTIF('Nov-Raw'!AD:AD,\"NA\")","v":0},{"$f":"COUNTIF('Nov-Raw'!AF:AF,\"NA\")","v":0},{"$f":"COUNTIF('Nov-Raw'!AH:AH,\"NA\")","v":0},{"$f":"COUNTIF('Nov-Raw'!AJ:AJ,\"NA\")","v":0},{"$f":"COUNTIF('Nov-Raw'!AL:AL,\"NA\")","v":0},{"$f":"COUNTIF('Nov-Raw'!AN:AN,\"NA\")","v":0},{"$f":"COUNTIF('Nov-Raw'!AP:AP,\"NA\")","v":0},{"$f":"COUNTIF('Nov-Raw'!AR:AR,\"NA\")","v":0},{"$f":"COUNTIF('Nov-Raw'!AT:AT,\"NA\")","v":0},{"$f":"COUNTIF('Nov-Raw'!AV:AV,\"NA\")","v":0},{"$f":"COUNTIF('Nov-Raw'!AX:AX,\"NA\")","v":0},{"$f":"COUNTIF('Nov-Raw'!AZ:AZ,\"NA\")","v":0},{"$f":"COUNTIF('Nov-Raw'!BB:BB,\"NA\")","v":0},{"$f":"COUNTIF('Nov-Raw'!BD:BD,\"NA\")","v":0},{"$f":"COUNTIF('Nov-Raw'!BF:BF,\"NA\")","v":0},{"$f":"COUNTIF('Nov-Raw'!BH:BH,\"NA\")","v":0},{"$f":"COUNTIF('Nov-Raw'!BJ:BJ,\"NA\")","v":0},{"$f":"COUNTIF('Nov-Raw'!BL:BL,\"NA\")","v":0},{"$f":"COUNTIF('Nov-Raw'!BN:BN,\"NA\")","v":0},{"$f":"COUNTIF('Nov-Raw'!BP:BP,\"NA\")","v":0},{"$f":"COUNTIF('Nov-Raw'!BR:BR,\"NA\")","v":0},{"$f":"COUNTIF('Nov-Raw'!BT:BT,\"NA\")","v":0},{"$f":"COUNTIF('Nov-Raw'!BV:BV,\"NA\")","v":0},{"$f":"COUNTIF('Nov-Raw'!BX:BX,\"NA\")","v":0},{"$f":"COUNTIF('Nov-Raw'!BZ:BZ,\"NA\")","v":0},{"$f":"COUNTIF('Nov-Raw'!CB:CB,\"NA\")","v":0},{"$f":"COUNTIF('Nov-Raw'!CD:CD,\"NA\")","v":0},{"$f":"COUNTIF('Nov-Raw'!CF:CF,\"NA\")","v":0},{"$f":"COUNTIF('Nov-Raw'!CH:CH,\"NA\")","v":0}]
["Blanks",{"$f":"B8-(SUM(B3:B6))","v":0},{"$f":"C8-(SUM(C3:C6))","v":0},0,0,0,0,0,0,0,0,0,4,4,4,4,4,4,4,4,4,4,4,4,4,4,4,4,4,4,4,4,4,4,4,4,4,4,4,4,4]
["full sample size",{"$f":"COUNTA('Nov-Raw'!A:A)-2","v":4},{"$f":"B8","v":4},4,4,4,4,4,4,4,4,4,4,4,4,4,4,4,4,4,4,4,4,4,4,4,4,4,4,4,4,4,4,4,4,4,4,4,4,4,4]
["True sample size (-NA + blanks)",{"$f":"IF(ISERROR(B8-(B6+B7)),\"\",B8-(B6+B7))","v":4},{"$f":"IF(ISERROR(C8-(C6+C7)),\"\",C8-(C6+C7))","v":4},4,4,4,4,4,4,4,4,4,0,0,0,0,0,0,0,0,0,0,0,0,0,0,0,0,0,0,0,0,0,0,0,0,0,0,0,0,0]
["%Y",{"$f":"IF(ISERROR(B3/B9),\"\",B3/B9)","v":1},{"$f":"IF(ISERROR(C3/C9),\"\",C3/C9)","v":1},1,1,0.75,1,0.5,0.75,0.5,1,1,"","","","","","","","","","","","","","","","","","","","","","","","","","","","",""]
["%N",{"$f":"IF(ISERROR(B4/B9),\"\",B4/B9)","v":0},{"$f":"IF(ISERROR(C4/C9),\"\",C4/C9)","v":0},0,0,0.25,0,0,0,0,0,0,"","","","","","","","","","","","","","","","","","","","","","","","","","","","",""]
["%N - Justified",{"$f":"IF(ISERROR(B5/B9),\"\",B5/B9)","v":0},{"$f":"IF(ISERROR(C5/C9),\"\",C5/C9)","v":0},0,0,0,0,0.5,0.25,0.5,0,0,"","","","","","","","","","","","","","","","","","","","","","","","","","","","",""]

{"sheet":"Dec","index":30,"n_rows":51,"n_cols":8,"rows_kept":51,"cut":false,"hidden":false,"merged":[]}
["Click here to go to year overview"]
[]
["Date",null,null,"Total by Apt type"]
["Completed by",null,null,"New",{"$f":"COUNTIF('Dec-Raw'!E3:E103,\"New\")","v":5}]
["Sample group size",{"$f":"COUNTA('Dec-Raw'!A:A)-2","v":5},null,"Follow up",{"$f":"COUNTIF('Dec-Raw'!E3:E103,\"Fup\")","v":0},null,null,{"$f":"Year!H5","v":0.95}]
["Overall Result (compliant only)",{"$f":"IF(ISERROR(SUM(D11:D50)/G51),\"\",SUM(D11:D50)/G51)","v":0.96363636363636362},null,"Total by apt Code",null,null,null,{"$f":"Year!H6","v":"80-95%"}]
["Overall Result (compliant & Justified)",{"$f":"IF(ISERROR(SUM(C11:C50)/G51),\"\",SUM(C11:C50)/G51)","v":0.96363636363636362},null,"code goes in here",{"$f":"COUNTIF('Dec-Raw'!F3:F103,D7)","v":0},null,null,{"$f":"Year!H7","v":0.8}]
["viable qs",{"$f":"G51","v":11}]
[]
["Metric","Target %","Compliant + Justified","Compliant","Justified","Not compliant","Irritating math"]
[{"$f":"IF(ISERROR(Q!A2),\"\",Q!A2)","v":"Was a Room number documented?"},{"$f":"IF(ISERROR(Q!B2),\"\",Q!B2)","v":0},{"$f":"IF(ISERROR(D11+E11),\"\",D11+E11)","v":1},{"$f":"'Dec-Data'!B10","v":1},{"$f":"'Dec-Data'!B12","v":0},{"$f":"'Dec-Data'!B11","v":0},{"$f":"COUNTIF(D11:F11,\">0\")","v":1}]
[{"$f":"IF(ISERROR(Q!A3),\"\",Q!A3)","v":"Were stage A checks completed as appropriate?"},{"$f":"IF(ISERROR(Q!B3),\"\",Q!B3)","v":0},1,{"$f":"'Dec-Data'!C10","v":1},{"$f":"'Dec-Data'!C12","v":0},{"$f":"'Dec-Data'!C11","v":0},1]
[{"$f":"IF(ISERROR(Q!A4),\"\",Q!A4)","v":"Was COSI Part 1 performed?"},{"$f":"IF(ISERROR(Q!B4),\"\",Q!B4)","v":0},0.6,{"$f":"'Dec-Data'!D10","v":0.6},{"$f":"'Dec-Data'!D12","v":0},{"$f":"'Dec-Data'!D11","v":0.4},2]
[{"$f":"IF(ISERROR(Q!A5),\"\",Q!A5)","v":"Was PVP documented?"},{"$f":"IF(ISERROR(Q!B5),\"\",Q!B5)","v":0},1,{"$f":"'Dec-Data'!E10","v":1},{"$f":"'Dec-Data'!E12","v":0},{"$f":"'Dec-Data'!E11","v":0},1]
[{"$f":"IF(ISERROR(Q!A6),\"\",Q!A6)","v":"Was Otoscopy documented?"},{"$f":"IF(ISERROR(Q!B6),\"\",Q!B6)","v":0},1,{"$f":"'Dec-Data'!F10","v":1},{"$f":"'Dec-Data'!F12","v":0},{"$f":"'Dec-Data'!F11","v":0},1]
[{"$f":"IF(ISERROR(Q!A7),\"\",Q!A7)","v":"Document bc at 3 & 4kHz is for programming purposes?"},{"$f":"IF(ISERROR(Q!B7),\"\",Q!B7)","v":0},1,{"$f":"'Dec-Data'!G10","v":1},{"$f":"'Dec-Data'!G12","v":0},{"$f":"'Dec-Data'!G11","v":0},1]
[{"$f":"IF(ISERROR(Q!A8),\"\",Q!A8)","v":"Was Speech testing performed?"},{"$f":"IF(ISERROR(Q!B8),\"\",Q!B8)","v":0},1,{"$f":"'Dec-Data'!H10","v":1},{"$f":"'Dec-Data'!H12","v":0},{"$f":"'Dec-Data'!H11","v":0},1]
[{"$f":"IF(ISERROR(Q!A9),\"\",Q!A9)","v":"Is it documented whether national criteria were/were not met?"},{"$f":"IF(ISERROR(Q!B9),\"\",Q!B9)","v":0},1,{"$f":"'Dec-Data'!I10","v":1},{"$f":"'Dec-Data'!I12","v":0},{"$f":"'Dec-Data'!I11","v":0},1]
[{"$f":"IF(ISERROR(Q!A10),\"\",Q!A10)","v":"Was a BCHI info pack supplied?"},{"$f":"IF(ISERROR(Q!B10),\"\",Q!B10)","v":0},1,{"$f":"'Dec-Data'!J10","v":1},{"$f":"'Dec-Data'!J12","v":0},{"$f":"'Dec-Data'!J11","v":0},1]
[{"$f":"IF(ISERROR(Q!A11),\"\",Q!A11)","v":"Was the report authorised & issued within target (7 days)?"},{"$f":"IF(ISERROR(Q!B11),\"\",Q!B11)","v":0},1,{"$f":"'Dec-Data'!K10","v":1},{"$f":"'Dec-Data'!K12","v":0},{"$f":"'Dec-Data'!K11","v":0},1]
[{"$f":"IF(ISERROR(Q!A12),\"\",Q!A12)","v":"Was consent documented as appropriate?"},{"$f":"IF(ISERROR(Q!B12),\"\",Q!B12)","v":0},1,{"$f":"'Dec-Data'!L10","v":1},{"$f":"'Dec-Data'!L12","v":0},{"$f":"'Dec-Data'!L11","v":0},1]
[{"$f":"IF(ISERROR(Q!A13),\"\",Q!A13)","v":0},{"$f":"IF(ISERROR(Q!B13),\"\",Q!B13)","v":0},"",{"$f":"'Dec-Data'!M10","v":""},{"$f":"'Dec-Data'!M12","v":""},{"$f":"'Dec-Data'!M11","v":""},0]
[{"$f":"IF(ISERROR(Q!A14),\"\",Q!A14)","v":0},{"$f":"IF(ISERROR(Q!B14),\"\",Q!B14)","v":0},"",{"$f":"'Dec-Data'!N10","v":""},{"$f":"'Dec-Data'!N12","v":""},{"$f":"'Dec-Data'!N11","v":""},0]
[{"$f":"IF(ISERROR(Q!A15),\"\",Q!A15)","v":0},{"$f":"IF(ISERROR(Q!B15),\"\",Q!B15)","v":0},"",{"$f":"'Dec-Data'!O10","v":""},{"$f":"'Dec-Data'!O12","v":""},{"$f":"'Dec-Data'!O11","v":""},0]
[{"$f":"IF(ISERROR(Q!A16),\"\",Q!A16)","v":0},{"$f":"IF(ISERROR(Q!B16),\"\",Q!B16)","v":0},"",{"$f":"'Dec-Data'!P10","v":""},{"$f":"'Dec-Data'!P12","v":""},{"$f":"'Dec-Data'!P11","v":""},0]
[{"$f":"IF(ISERROR(Q!A17),\"\",Q!A17)","v":0},{"$f":"IF(ISERROR(Q!B17),\"\",Q!B17)","v":0},"",{"$f":"'Dec-Data'!Q10","v":""},{"$f":"'Dec-Data'!Q12","v":""},{"$f":"'Dec-Data'!Q11","v":""},0]
[{"$f":"IF(ISERROR(Q!A18),\"\",Q!A18)","v":0},{"$f":"IF(ISERROR(Q!B18),\"\",Q!B18)","v":0},"",{"$f":"'Dec-Data'!R10","v":""},{"$f":"'Dec-Data'!R12","v":""},{"$f":"'Dec-Data'!R11","v":""},0]
[{"$f":"IF(ISERROR(Q!A19),\"\",Q!A19)","v":0},{"$f":"IF(ISERROR(Q!B19),\"\",Q!B19)","v":0},"",{"$f":"'Dec-Data'!S10","v":""},{"$f":"'Dec-Data'!S12","v":""},{"$f":"'Dec-Data'!S11","v":""},0]
[{"$f":"IF(ISERROR(Q!A20),\"\",Q!A20)","v":0},{"$f":"IF(ISERROR(Q!B20),\"\",Q!B20)","v":0},"",{"$f":"'Dec-Data'!T10","v":""},{"$f":"'Dec-Data'!T12","v":""},{"$f":"'Dec-Data'!T11","v":""},0]
[{"$f":"IF(ISERROR(Q!A21),\"\",Q!A21)","v":0},{"$f":"IF(ISERROR(Q!B21),\"\",Q!B21)","v":0},"",{"$f":"'Dec-Data'!U10","v":""},{"$f":"'Dec-Data'!U12","v":""},{"$f":"'Dec-Data'!U11","v":""},0]
[{"$f":"IF(ISERROR(Q!A22),\"\",Q!A22)","v":0},{"$f":"IF(ISERROR(Q!B22),\"\",Q!B22)","v":0},"",{"$f":"'Dec-Data'!V10","v":""},{"$f":"'Dec-Data'!V12","v":""},{"$f":"'Dec-Data'!V11","v":""},0]
[{"$f":"IF(ISERROR(Q!A23),\"\",Q!A23)","v":0},{"$f":"IF(ISERROR(Q!B23),\"\",Q!B23)","v":0},"",{"$f":"'Dec-Data'!W10","v":""},{"$f":"'Dec-Data'!W12","v":""},{"$f":"'Dec-Data'!W11","v":""},0]
[{"$f":"IF(ISERROR(Q!A24),\"\",Q!A24)","v":0},{"$f":"IF(ISERROR(Q!B24),\"\",Q!B24)","v":0},"",{"$f":"'Dec-Data'!X10","v":""},{"$f":"'Dec-Data'!X12","v":""},{"$f":"'Dec-Data'!X11","v":""},0]
[{"$f":"IF(ISERROR(Q!A25),\"\",Q!A25)","v":0},{"$f":"IF(ISERROR(Q!B25),\"\",Q!B25)","v":0},"",{"$f":"'Dec-Data'!Y10","v":""},{"$f":"'Dec-Data'!Y12","v":""},{"$f":"'Dec-Data'!Y11","v":""},0]
[{"$f":"IF(ISERROR(Q!A26),\"\",Q!A26)","v":0},{"$f":"IF(ISERROR(Q!B26),\"\",Q!B26)","v":0},"",{"$f":"'Dec-Data'!Z10","v":""},{"$f":"'Dec-Data'!Z12","v":""},{"$f":"'Dec-Data'!Z11","v":""},0]
[{"$f":"IF(ISERROR(Q!A27),\"\",Q!A27)","v":0},{"$f":"IF(ISERROR(Q!B27),\"\",Q!B27)","v":0},"",{"$f":"'Dec-Data'!AA10","v":""},{"$f":"'Dec-Data'!AA12","v":""},{"$f":"'Dec-Data'!AA11","v":""},0]
[{"$f":"IF(ISERROR(Q!A28),\"\",Q!A28)","v":0},{"$f":"IF(ISERROR(Q!B28),\"\",Q!B28)","v":0},"",{"$f":"'Dec-Data'!AB10","v":""},{"$f":"'Dec-Data'!AB12","v":""},{"$f":"'Dec-Data'!AB11","v":""},0]
[{"$f":"IF(ISERROR(Q!A29),\"\",Q!A29)","v":0},{"$f":"IF(ISERROR(Q!B29),\"\",Q!B29)","v":0},"",{"$f":"'Dec-Data'!AC10","v":""},{"$f":"'Dec-Data'!AC12","v":""},{"$f":"'Dec-Data'!AC11","v":""},0]
[{"$f":"IF(ISERROR(Q!A30),\"\",Q!A30)","v":0},{"$f":"IF(ISERROR(Q!B30),\"\",Q!B30)","v":0},"",{"$f":"'Dec-Data'!AD10","v":""},{"$f":"'Dec-Data'!AD12","v":""},{"$f":"'Dec-Data'!AD11","v":""},0]
[{"$f":"IF(ISERROR(Q!A31),\"\",Q!A31)","v":0},{"$f":"IF(ISERROR(Q!B31),\"\",Q!B31)","v":0},"",{"$f":"'Dec-Data'!AE10","v":""},{"$f":"'Dec-Data'!AE12","v":""},{"$f":"'Dec-Data'!AE11","v":""},0]
[{"$f":"IF(ISERROR(Q!A32),\"\",Q!A32)","v":0},{"$f":"IF(ISERROR(Q!B32),\"\",Q!B32)","v":0},"",{"$f":"'Dec-Data'!AF10","v":""},{"$f":"'Dec-Data'!AF12","v":""},{"$f":"'Dec-Data'!AF11","v":""},0]
[{"$f":"IF(ISERROR(Q!A33),\"\",Q!A33)","v":0},{"$f":"IF(ISERROR(Q!B33),\"\",Q!B33)","v":0},"",{"$f":"'Dec-Data'!AG10","v":""},{"$f":"'Dec-Data'!AG12","v":""},{"$f":"'Dec-Data'!AG11","v":""},0]
[{"$f":"IF(ISERROR(Q!A34),\"\",Q!A34)","v":0},{"$f":"IF(ISERROR(Q!B34),\"\",Q!B34)","v":0},"",{"$f":"'Dec-Data'!AH10","v":""},{"$f":"'Dec-Data'!AH12","v":""},{"$f":"'Dec-Data'!AH11","v":""},0]
[{"$f":"IF(ISERROR(Q!A35),\"\",Q!A35)","v":0},{"$f":"IF(ISERROR(Q!B35),\"\",Q!B35)","v":0},"",{"$f":"'Dec-Data'!AI10","v":""},{"$f":"'Dec-Data'!AI12","v":""},{"$f":"'Dec-Data'!AI11","v":""},0]
[{"$f":"IF(ISERROR(Q!A36),\"\",Q!A36)","v":0},{"$f":"IF(ISERROR(Q!B36),\"\",Q!B36)","v":0},"",{"$f":"'Dec-Data'!AJ10","v":""},{"$f":"'Dec-Data'!AJ12","v":""},{"$f":"'Dec-Data'!AJ11","v":""},0]
[{"$f":"IF(ISERROR(Q!A37),\"\",Q!A37)","v":0},{"$f":"IF(ISERROR(Q!B37),\"\",Q!B37)","v":0},"",{"$f":"'Dec-Data'!AK10","v":""},{"$f":"'Dec-Data'!AK12","v":""},{"$f":"'Dec-Data'!AK11","v":""},0]
[{"$f":"IF(ISERROR(Q!A38),\"\",Q!A38)","v":0},{"$f":"IF(ISERROR(Q!B38),\"\",Q!B38)","v":0},"",{"$f":"'Dec-Data'!AL10","v":""},{"$f":"'Dec-Data'!AL12","v":""},{"$f":"'Dec-Data'!AL11","v":""},0]
[{"$f":"IF(ISERROR(Q!A39),\"\",Q!A39)","v":0},{"$f":"IF(ISERROR(Q!B39),\"\",Q!B39)","v":0},"",{"$f":"'Dec-Data'!AM10","v":""},{"$f":"'Dec-Data'!AM12","v":""},{"$f":"'Dec-Data'!AM11","v":""},0]
[{"$f":"IF(ISERROR(Q!A40),\"\",Q!A40)","v":0},{"$f":"IF(ISERROR(Q!B40),\"\",Q!B40)","v":0},"",{"$f":"'Dec-Data'!AN10","v":""},{"$f":"'Dec-Data'!AN12","v":""},{"$f":"'Dec-Data'!AN11","v":""},0]
[{"$f":"IF(ISERROR(Q!A41),\"\",Q!A41)","v":0},{"$f":"IF(ISERROR(Q!B41),\"\",Q!B41)","v":0},"",{"$f":"'Dec-Data'!AO10","v":""},{"$f":"'Dec-Data'!AO12","v":""},{"$f":"'Dec-Data'!AO11","v":""},0]
[null,null,null,null,null,null,{"$f":"COUNTIF(G11:G50,\">=1\")","v":11}]

{"sheet":"Dec-Raw","index":31,"n_rows":7,"n_cols":87,"rows_kept":7,"cut":false,"hidden":true,"merged":[[0,85,0,86],[0,63,0,64],[0,65,0,66],[0,67,0,68],[0,69,0,70],[0,71,0,72],[0,73,0,74],[0,75,0,76],[0,77,0,78],[0,79,0,80],[0,81,0,82],[0,83,0,84],[0,61,0,62],[0,39,0,40],[0,41,0,42],[0,43,0,44],[0,45,0,46],[0,47,0,48],[0,49,0,50],[0,51,0,52],[0,53,0,54],[0,55,0,56],[0,57,0,58],[0,59,0,60],[0,37,0,38],[0,15,0,16],[0,17,0,18],[0,19,0,20],[0,21,0,22],[0,23,0,24],[0,25,0,26],[0,27,0,28],[0,29,0,30],[0,31,0,32],[0,33,0,34],[0,35,0,36],[0,13,0,14],[0,0,0,5],[0,6,1,6],[0,7,0,8],[0,9,0,10],[0,11,0,12]]}
["Record details",null,null,null,null,null,"Notes",{"$f":"Q!A2","v":"Was a Room number documented?"},null,{"$f":"Q!A3","v":"Were stage A checks completed as appropriate?"},null,{"$f":"Q!A4","v":"Was COSI Part 1 performed?"},null,{"$f":"Q!A5","v":"Was PVP documented?"},null,{"$f":"Q!A6","v":"Was Otoscopy documented?"},null,{"$f":"Q!A7","v":"Document bc at 3 & 4kHz is for programming purposes?"},null,{"$f":"Q!A8","v":"Was Speech testing performed?"},null,{"$f":"Q!A9","v":"Is it documented whether national criteria were/were not met?"},null,{"$f":"Q!A10","v":"Was a BCHI info pack supplied?"},null,{"$f":"Q!A11","v":"Was the report authorised & issued within target (7 days)?"},null,{"$f":"Q!A12","v":"Was consent documented as appropriate?"},null,{"$f":"Q!A13","v":0},null,{"$f":"Q!A14","v":0},null,{"$f":"Q!A15","v":0},null,{"$f":"Q!A16","v":0},null,{"$f":"Q!A17","v":0},null,{"$f":"Q!A18","v":0},null,{"$f":"Q!A19","v":0},null,{"$f":"Q!A20","v":0},null,{"$f":"Q!A21","v":0},null,{"$f":"Q!A22","v":0},null,{"$f":"Q!A23","v":0},null,{"$f":"Q!A24","v":0},null,{"$f":"Q!A25","v":0},null,{"$f":"Q!A26","v":0},null,{"$f":"Q!A27","v":0},null,{"$f":"Q!A28","v":0},null,{"$f":"Q!A29","v":0},null,{"$f":"Q!A30","v":0},null,{"$f":"Q!A31","v":0},null,{"$f":"Q!A32","v":0},null,{"$f":"Q!A33","v":0},null,{"$f":"Q!A34","v":0},null,{"$f":"Q!A35","v":0},null,{"$f":"Q!A36","v":0},null,{"$f":"Q!A37","v":0},null,{"$f":"Q!A38","v":0},null,{"$f":"Q!A39","v":0},null,{"$f":"Q!A40","v":0},null,{"$f":"Q!A41","v":0}]
["Pt number","Date seen","Clinician 1","clinician 2","New/ F-up","Apt code",null,"Compliant?","Other result","Compliant?","Other result","Compliant?","Other result","Compliant?","Other result","Compliant?","Other result","Compliant?","Other result","Compliant?","Other result","Compliant?","Other result","Compliant?","Other result","Compliant?","Other result","Compliant?","Other result","Compliant?","Other result","Compliant?","Other result","Compliant?","Other result","Compliant?","Other result","Compliant?","Other result","Compliant?","Other result","Compliant?","Other result","Compliant?","Other result","Compliant?","Other result","Compliant?","Other result","Compliant?","Other result","Compliant?","Other result","Compliant?","Other result","Compliant?","Other result","Compliant?","Other result","Compliant?","Other result","Compliant?","Other result","Compliant?","Other result","Compliant?","Other result","Compliant?","Other result","Compliant?","Other result","Compliant?","Other result","Compliant?","Other result","Compliant?","Other result","Compliant?","Other result","Compliant?","Other result","Compliant?","Other result","Compliant?","Other result","Compliant?","Other result"]
["AB0001","2023-12-12","AA",null,"New","BA",null,"Yes",null,"Yes",null,"No",null,"Yes",null,"Yes",null,"Yes",null,"Yes",null,"Yes",null,"Yes",null,"Yes",null,"Yes"]
["AB0002","2023-12-17","AA",null,"New","BA",null,"Yes",null,"Yes",null,"Yes",null,"Yes",null,"Yes",null,"Yes",null,"Yes",null,"Yes",null,"Yes",null,"Yes",null,"Yes"]
["AB0003","2023-12-24","BB",null,"New","BA",null,"Yes",null,"Yes",null,"Yes",null,"Yes",null,"Yes",null,"Yes",null,"Yes",null,"Yes",null,"Yes",null,"Yes",null,"Yes"]
["AB0012","2023-12-26","BB",null,"New","BA",null,"Yes",null,"Yes",null,"No",null,"Yes",null,"Yes",null,"Yes",null,"Yes",null,"Yes",null,"Yes",null,"Yes",null,"Yes"]
["AB0005","2023-12-28","CC",null,"New","BA",null,"Yes",null,"Yes",null,"Yes",null,"Yes",null,"Yes",null,"Yes",null,"Yes",null,"Yes",null,"Yes",null,"Yes",null,"Yes"]

{"sheet":"Dec-Data","index":32,"n_rows":12,"n_cols":41,"rows_kept":12,"cut":false,"hidden":true,"merged":[[0,0,1,0]]}
["Results",{"$f":"Q!A2","v":"Was a Room number documented?"},{"$f":"Q!A3","v":"Were stage A checks completed as appropriate?"},{"$f":"Q!A4","v":"Was COSI Part 1 performed?"},{"$f":"Q!A5","v":"Was PVP documented?"},{"$f":"Q!A6","v":"Was Otoscopy documented?"},{"$f":"Q!A7","v":"Document bc at 3 & 4kHz is for programming purposes?"},{"$f":"Q!A8","v":"Was Speech testing performed?"},{"$f":"Q!A9","v":"Is it documented whether national criteria were/were not met?"},{"$f":"Q!A10","v":"Was a BCHI info pack supplied?"},{"$f":"Q!A11","v":"Was the report authorised & issued within target (7 days)?"},{"$f":"Q!A12","v":"Was consent documented as appropriate?"},{"$f":"Q!A13","v":0},{"$f":"Q!A14","v":0},{"$f":"Q!A15","v":0},{"$f":"Q!A16","v":0},{"$f":"Q!A17","v":0},{"$f":"Q!A18","v":0},{"$f":"Q!A19","v":0},{"$f":"Q!A20","v":0},{"$f":"Q!A21","v":0},{"$f":"Q!A22","v":0},{"$f":"Q!A23","v":0},{"$f":"Q!A24","v":0},{"$f":"Q!A25","v":0},{"$f":"Q!A26","v":0},{"$f":"Q!A27","v":0},{"$f":"Q!A28","v":0},{"$f":"Q!A29","v":0},{"$f":"Q!A30","v":0},{"$f":"Q!A31","v":0},{"$f":"Q!A32","v":0},{"$f":"Q!A33","v":0},{"$f":"Q!A34","v":0},{"$f":"Q!A35","v":0},{"$f":"Q!A36","v":0},{"$f":"Q!A37","v":0},{"$f":"Q!A38","v":0},{"$f":"Q!A39","v":0},{"$f":"Q!A40","v":0},{"$f":"Q!A41","v":0}]
[null,"Compliant?","Compliant?","Compliant?","Compliant?","Compliant?","Compliant?","Compliant?","Compliant?","Compliant?","Compliant?","Compliant?","Compliant?","Compliant?","Compliant?","Compliant?","Compliant?","Compliant?","Compliant?","Compliant?","Compliant?","Compliant?","Compliant?","Compliant?","Compliant?","Compliant?","Compliant?","Compliant?","Compliant?","Compliant?","Compliant?","Compliant?","Compliant?","Compliant?","Compliant?","Compliant?","Compliant?","Compliant?","Compliant?","Compliant?","Compliant?"]
["Total Y",{"$f":"COUNTIF('Dec-Raw'!H:H,\"yes\")","v":5},{"$f":"COUNTIF('Dec-Raw'!J:J,\"yes\")","v":5},{"$f":"COUNTIF('Dec-Raw'!L:L,\"yes\")","v":3},{"$f":"COUNTIF('Dec-Raw'!N:N,\"yes\")","v":5},{"$f":"COUNTIF('Dec-Raw'!P:P,\"yes\")","v":5},{"$f":"COUNTIF('Dec-Raw'!R:R,\"yes\")","v":5},{"$f":"COUNTIF('Dec-Raw'!T:T,\"yes\")","v":5},{"$f":"COUNTIF('Dec-Raw'!V:V,\"yes\")","v":5},{"$f":"COUNTIF('Dec-Raw'!X:X,\"yes\")","v":5},{"$f":"COUNTIF('Dec-Raw'!Z:Z,\"yes\")","v":5},{"$f":"COUNTIF('Dec-Raw'!AB:AB,\"yes\")","v":5},{"$f":"COUNTIF('Dec-Raw'!AD:AD,\"yes\")","v":0},{"$f":"COUNTIF('Dec-Raw'!AF:AF,\"yes\")","v":0},{"$f":"COUNTIF('Dec-Raw'!AH:AH,\"yes\")","v":0},{"$f":"COUNTIF('Dec-Raw'!AJ:AJ,\"yes\")","v":0},{"$f":"COUNTIF('Dec-Raw'!AL:AL,\"yes\")","v":0},{"$f":"COUNTIF('Dec-Raw'!AN:AN,\"yes\")","v":0},{"$f":"COUNTIF('Dec-Raw'!AP:AP,\"yes\")","v":0},{"$f":"COUNTIF('Dec-Raw'!AR:AR,\"yes\")","v":0},{"$f":"COUNTIF('Dec-Raw'!AT:AT,\"yes\")","v":0},{"$f":"COUNTIF('Dec-Raw'!AV:AV,\"yes\")","v":0},{"$f":"COUNTIF('Dec-Raw'!AX:AX,\"yes\")","v":0},{"$f":"COUNTIF('Dec-Raw'!AZ:AZ,\"yes\")","v":0},{"$f":"COUNTIF('Dec-Raw'!BB:BB,\"yes\")","v":0},{"$f":"COUNTIF('Dec-Raw'!BD:BD,\"yes\")","v":0},{"$f":"COUNTIF('Dec-Raw'!BF:BF,\"yes\")","v":0},{"$f":"COUNTIF('Dec-Raw'!BH:BH,\"yes\")","v":0},{"$f":"COUNTIF('Dec-Raw'!BJ:BJ,\"yes\")","v":0},{"$f":"COUNTIF('Dec-Raw'!BL:BL,\"yes\")","v":0},{"$f":"COUNTIF('Dec-Raw'!BN:BN,\"yes\")","v":0},{"$f":"COUNTIF('Dec-Raw'!BP:BP,\"yes\")","v":0},{"$f":"COUNTIF('Dec-Raw'!BR:BR,\"yes\")","v":0},{"$f":"COUNTIF('Dec-Raw'!BT:BT,\"yes\")","v":0},{"$f":"COUNTIF('Dec-Raw'!BV:BV,\"yes\")","v":0},{"$f":"COUNTIF('Dec-Raw'!BX:BX,\"yes\")","v":0},{"$f":"COUNTIF('Dec-Raw'!BZ:BZ,\"yes\")","v":0},{"$f":"COUNTIF('Dec-Raw'!CB:CB,\"yes\")","v":0},{"$f":"COUNTIF('Dec-Raw'!CD:CD,\"yes\")","v":0},{"$f":"COUNTIF('Dec-Raw'!CF:CF,\"yes\")","v":0},{"$f":"COUNTIF('Dec-Raw'!CH:CH,\"yes\")","v":0}]
["Total N",{"$f":"COUNTIF('Dec-Raw'!H:H,\"no\")","v":0},{"$f":"COUNTIF('Dec-Raw'!J:J,\"no\")","v":0},{"$f":"COUNTIF('Dec-Raw'!L:L,\"no\")","v":2},{"$f":"COUNTIF('Dec-Raw'!N:N,\"no\")","v":0},{"$f":"COUNTIF('Dec-Raw'!P:P,\"no\")","v":0},{"$f":"COUNTIF('Dec-Raw'!R:R,\"no\")","v":0},{"$f":"COUNTIF('Dec-Raw'!T:T,\"no\")","v":0},{"$f":"COUNTIF('Dec-Raw'!V:V,\"no\")","v":0},{"$f":"COUNTIF('Dec-Raw'!X:X,\"no\")","v":0},{"$f":"COUNTIF('Dec-Raw'!Z:Z,\"no\")","v":0},{"$f":"COUNTIF('Dec-Raw'!AB:AB,\"no\")","v":0},{"$f":"COUNTIF('Dec-Raw'!AD:AD,\"no\")","v":0},{"$f":"COUNTIF('Dec-Raw'!AF:AF,\"no\")","v":0},{"$f":"COUNTIF('Dec-Raw'!AH:AH,\"no\")","v":0},{"$f":"COUNTIF('Dec-Raw'!AJ:AJ,\"no\")","v":0},{"$f":"COUNTIF('Dec-Raw'!AL:AL,\"no\")","v":0},{"$f":"COUNTIF('Dec-Raw'!AN:AN,\"no\")","v":0},{"$f":"COUNTIF('Dec-Raw'!AP:AP,\"no\")","v":0},{"$f":"COUNTIF('Dec-Raw'!AR:AR,\"no\")","v":0},{"$f":"COUNTIF('Dec-Raw'!AT:AT,\"no\")","v":0},{"$f":"COUNTIF('Dec-Raw'!AV:AV,\"no\")","v":0},{"$f":"COUNTIF('Dec-Raw'!AX:AX,\"no\")","v":0},{"$f":"COUNTIF('Dec-Raw'!AZ:AZ,\"no\")","v":0},{"$f":"COUNTIF('Dec-Raw'!BB:BB,\"no\")","v":0},{"$f":"COUNTIF('Dec-Raw'!BD:BD,\"no\")","v":0},{"$f":"COUNTIF('Dec-Raw'!BF:BF,\"no\")","v":0},{"$f":"COUNTIF('Dec-Raw'!BH:BH,\"no\")","v":0},{"$f":"COUNTIF('Dec-Raw'!BJ:BJ,\"no\")","v":0},{"$f":"COUNTIF('Dec-Raw'!BL:BL,\"no\")","v":0},{"$f":"COUNTIF('Dec-Raw'!BN:BN,\"no\")","v":0},{"$f":"COUNTIF('Dec-Raw'!BP:BP,\"no\")","v":0},{"$f":"COUNTIF('Dec-Raw'!BR:BR,\"no\")","v":0},{"$f":"COUNTIF('Dec-Raw'!BT:BT,\"no\")","v":0},{"$f":"COUNTIF('Dec-Raw'!BV:BV,\"no\")","v":0},{"$f":"COUNTIF('Dec-Raw'!BX:BX,\"no\")","v":0},{"$f":"COUNTIF('Dec-Raw'!BZ:BZ,\"no\")","v":0},{"$f":"COUNTIF('Dec-Raw'!CB:CB,\"no\")","v":0},{"$f":"COUNTIF('Dec-Raw'!CD:CD,\"no\")","v":0},{"$f":"COUNTIF('Dec-Raw'!CF:CF,\"no\")","v":0},{"$f":"COUNTIF('Dec-Raw'!CH:CH,\"no\")","v":0}]
["Total Justified",{"$f":"COUNTIF('Dec-Raw'!H:H,\"Justified\")","v":0},{"$f":"COUNTIF('Dec-Raw'!J:J,\"Justified\")","v":0},{"$f":"COUNTIF('Dec-Raw'!L:L,\"Justified\")","v":0},{"$f":"COUNTIF('Dec-Raw'!N:N,\"Justified\")","v":0},{"$f":"COUNTIF('Dec-Raw'!P:P,\"Justified\")","v":0},{"$f":"COUNTIF('Dec-Raw'!R:R,\"Justified\")","v":0},{"$f":"COUNTIF('Dec-Raw'!T:T,\"Justified\")","v":0},{"$f":"COUNTIF('Dec-Raw'!V:V,\"Justified\")","v":0},{"$f":"COUNTIF('Dec-Raw'!X:X,\"Justified\")","v":0},{"$f":"COUNTIF('Dec-Raw'!Z:Z,\"Justified\")","v":0},{"$f":"COUNTIF('Dec-Raw'!AB:AB,\"Justified\")","v":0},{"$f":"COUNTIF('Dec-Raw'!AD:AD,\"Justified\")","v":0},{"$f":"COUNTIF('Dec-Raw'!AF:AF,\"Justified\")","v":0},{"$f":"COUNTIF('Dec-Raw'!AH:AH,\"Justified\")","v":0},{"$f":"COUNTIF('Dec-Raw'!AJ:AJ,\"Justified\")","v":0},{"$f":"COUNTIF('Dec-Raw'!AL:AL,\"Justified\")","v":0},{"$f":"COUNTIF('Dec-Raw'!AN:AN,\"Justified\")","v":0},{"$f":"COUNTIF('Dec-Raw'!AP:AP,\"Justified\")","v":0},{"$f":"COUNTIF('Dec-Raw'!AR:AR,\"Justified\")","v":0},{"$f":"COUNTIF('Dec-Raw'!AT:AT,\"Justified\")","v":0},{"$f":"COUNTIF('Dec-Raw'!AV:AV,\"Justified\")","v":0},{"$f":"COUNTIF('Dec-Raw'!AX:AX,\"Justified\")","v":0},{"$f":"COUNTIF('Dec-Raw'!AZ:AZ,\"Justified\")","v":0},{"$f":"COUNTIF('Dec-Raw'!BB:BB,\"Justified\")","v":0},{"$f":"COUNTIF('Dec-Raw'!BD:BD,\"Justified\")","v":0},{"$f":"COUNTIF('Dec-Raw'!BF:BF,\"Justified\")","v":0},{"$f":"COUNTIF('Dec-Raw'!BH:BH,\"Justified\")","v":0},{"$f":"COUNTIF('Dec-Raw'!BJ:BJ,\"Justified\")","v":0},{"$f":"COUNTIF('Dec-Raw'!BL:BL,\"Justified\")","v":0},{"$f":"COUNTIF('Dec-Raw'!BN:BN,\"Justified\")","v":0},{"$f":"COUNTIF('Dec-Raw'!BP:BP,\"Justified\")","v":0},{"$f":"COUNTIF('Dec-Raw'!BR:BR,\"Justified\")","v":0},{"$f":"COUNTIF('Dec-Raw'!BT:BT,\"Justified\")","v":0},{"$f":"COUNTIF('Dec-Raw'!BV:BV,\"Justified\")","v":0},{"$f":"COUNTIF('Dec-Raw'!BX:BX,\"Justified\")","v":0},{"$f":"COUNTIF('Dec-Raw'!BZ:BZ,\"Justified\")","v":0},{"$f":"COUNTIF('Dec-Raw'!CB:CB,\"Justified\")","v":0},{"$f":"COUNTIF('Dec-Raw'!CD:CD,\"Justified\")","v":0},{"$f":"COUNTIF('Dec-Raw'!CF:CF,\"Justified\")","v":0},{"$f":"COUNTIF('Dec-Raw'!CH:CH,\"Justified\")","v":0}]
["Total NA",{"$f":"COUNTIF('Dec-Raw'!H:H,\"NA\")","v":0},{"$f":"COUNTIF('Dec-Raw'!J:J,\"NA\")","v":0},{"$f":"COUNTIF('Dec-Raw'!L:L,\"NA\")","v":0},{"$f":"COUNTIF('Dec-Raw'!N:N,\"NA\")","v":0},{"$f":"COUNTIF('Dec-Raw'!P:P,\"NA\")","v":0},{"$f":"COUNTIF('Dec-Raw'!R:R,\"NA\")","v":0},{"$f":"COUNTIF('Dec-Raw'!T:T,\"NA\")","v":0},{"$f":"COUNTIF('Dec-Raw'!V:V,\"NA\")","v":0},{"$f":"COUNTIF('Dec-Raw'!X:X,\"NA\")","v":0},{"$f":"COUNTIF('Dec-Raw'!Z:Z,\"NA\")","v":0},{"$f":"COUNTIF('Dec-Raw'!AB:AB,\"NA\")","v":0},{"$f":"COUNTIF('Dec-Raw'!AD:AD,\"NA\")","v":0},{"$f":"COUNTIF('Dec-Raw'!AF:AF,\"NA\")","v":0},{"$f":"COUNTIF('Dec-Raw'!AH:AH,\"NA\")","v":0},{"$f":"COUNTIF('Dec-Raw'!AJ:AJ,\"NA\")","v":0},{"$f":"COUNTIF('Dec-Raw'!AL:AL,\"NA\")","v":0},{"$f":"COUNTIF('Dec-Raw'!AN:AN,\"NA\")","v":0},{"$f":"COUNTIF('Dec-Raw'!AP:AP,\"NA\")","v":0},{"$f":"COUNTIF('Dec-Raw'!AR:AR,\"NA\")","v":0},{"$f":"COUNTIF('Dec-Raw'!AT:AT,\"NA\")","v":0},{"$f":"COUNTIF('Dec-Raw'!AV:AV,\"NA\")","v":0},{"$f":"COUNTIF('Dec-Raw'!AX:AX,\"NA\")","v":0},{"$f":"COUNTIF('Dec-Raw'!AZ:AZ,\"NA\")","v":0},{"$f":"COUNTIF('Dec-Raw'!BB:BB,\"NA\")","v":0},{"$f":"COUNTIF('Dec-Raw'!BD:BD,\"NA\")","v":0},{"$f":"COUNTIF('Dec-Raw'!BF:BF,\"NA\")","v":0},{"$f":"COUNTIF('Dec-Raw'!BH:BH,\"NA\")","v":0},{"$f":"COUNTIF('Dec-Raw'!BJ:BJ,\"NA\")","v":0},{"$f":"COUNTIF('Dec-Raw'!BL:BL,\"NA\")","v":0},{"$f":"COUNTIF('Dec-Raw'!BN:BN,\"NA\")","v":0},{"$f":"COUNTIF('Dec-Raw'!BP:BP,\"NA\")","v":0},{"$f":"COUNTIF('Dec-Raw'!BR:BR,\"NA\")","v":0},{"$f":"COUNTIF('Dec-Raw'!BT:BT,\"NA\")","v":0},{"$f":"COUNTIF('Dec-Raw'!BV:BV,\"NA\")","v":0},{"$f":"COUNTIF('Dec-Raw'!BX:BX,\"NA\")","v":0},{"$f":"COUNTIF('Dec-Raw'!BZ:BZ,\"NA\")","v":0},{"$f":"COUNTIF('Dec-Raw'!CB:CB,\"NA\")","v":0},{"$f":"COUNTIF('Dec-Raw'!CD:CD,\"NA\")","v":0},{"$f":"COUNTIF('Dec-Raw'!CF:CF,\"NA\")","v":0},{"$f":"COUNTIF('Dec-Raw'!CH:CH,\"NA\")","v":0}]
["Blanks",{"$f":"B8-(SUM(B3:B6))","v":0},{"$f":"C8-(SUM(C3:C6))","v":0},0,0,0,0,0,0,0,0,0,5,5,5,5,5,5,5,5,5,5,5,5,5,5,5,5,5,5,5,5,5,5,5,5,5,5,5,5,5]
["full sample size",{"$f":"COUNTA('Dec-Raw'!A:A)-2","v":5},{"$f":"B8","v":5},5,5,5,5,5,5,5,5,5,5,5,5,5,5,5,5,5,5,5,5,5,5,5,5,5,5,5,5,5,5,5,5,5,5,5,5,5,5]
["True sample size (-NA + blanks)",{"$f":"IF(ISERROR(B8-(B6+B7)),\"\",B8-(B6+B7))","v":5},{"$f":"IF(ISERROR(C8-(C6+C7)),\"\",C8-(C6+C7))","v":5},5,5,5,5,5,5,5,5,5,0,0,0,0,0,0,0,0,0,0,0,0,0,0,0,0,0,0,0,0,0,0,0,0,0,0,0,0,0]
["%Y",{"$f":"IF(ISERROR(B3/B9),\"\",B3/B9)","v":1},{"$f":"IF(ISERROR(C3/C9),\"\",C3/C9)","v":1},0.6,1,1,1,1,1,1,1,1,"","","","","","","","","","","","","","","","","","","","","","","","","","","","",""]
["%N",{"$f":"IF(ISERROR(B4/B9),\"\",B4/B9)","v":0},{"$f":"IF(ISERROR(C4/C9),\"\",C4/C9)","v":0},0.4,0,0,0,0,0,0,0,0,"","","","","","","","","","","","","","","","","","","","","","","","","","","","",""]
["%N - Justified",{"$f":"IF(ISERROR(B5/B9),\"\",B5/B9)","v":0},{"$f":"IF(ISERROR(C5/C9),\"\",C5/C9)","v":0},0,0,0,0,0,0,0,0,0,"","","","","","","","","","","","","","","","","","","","","","","","","","","","",""]

{"sheet":"Jan","index":33,"n_rows":51,"n_cols":8,"rows_kept":51,"cut":false,"hidden":false,"merged":[]}
["Click here to go to year overview"]
[]
["Date",null,null,"Total by Apt type"]
["Completed by",null,null,"New",{"$f":"COUNTIF('Jan-Raw'!E3:E103,\"New\")","v":6}]
["Sample group size",{"$f":"COUNTA('Jan-Raw'!A:A)-2","v":6},null,"Follow up",{"$f":"COUNTIF('Jan-Raw'!E3:E103,\"Fup\")","v":0},null,null,{"$f":"Year!H5","v":0.95}]
["Overall Result (compliant only)",{"$f":"IF(ISERROR(SUM(D11:D50)/G51),\"\",SUM(D11:D50)/G51)","v":0.96969696969696983},null,"Total by apt Code",null,null,null,{"$f":"Year!H6","v":"80-95%"}]
["Overall Result (compliant & Justified)",{"$f":"IF(ISERROR(SUM(C11:C50)/G51),\"\",SUM(C11:C50)/G51)","v":0.96969696969696983},null,"code goes in here",{"$f":"COUNTIF('Jan-Raw'!F3:F103,D7)","v":0},null,null,{"$f":"Year!H7","v":0.8}]
["viable qs",{"$f":"G51","v":11}]
[]
["Metric","Target %","Compliant + Justified","Compliant","Justified","Not compliant","Irritating math"]
[{"$f":"IF(ISERROR(Q!A2),\"\",Q!A2)","v":"Was a Room number documented?"},{"$f":"IF(ISERROR(Q!B2),\"\",Q!B2)","v":0},{"$f":"IF(ISERROR(D11+E11),\"\",D11+E11)","v":1},{"$f":"'Jan-Data'!B10","v":1},{"$f":"'Jan-Data'!B12","v":0},{"$f":"'Jan-Data'!B11","v":0},{"$f":"COUNTIF(D11:F11,\">0\")","v":1}]
[{"$f":"IF(ISERROR(Q!A3),\"\",Q!A3)","v":"Were stage A checks completed as appropriate?"},{"$f":"IF(ISERROR(Q!B3),\"\",Q!B3)","v":0},0.83333333333333337,{"$f":"'Jan-Data'!C10","v":0.83333333333333337},{"$f":"'Jan-Data'!C12","v":0},{"$f":"'Jan-Data'!C11","v":0.16666666666666666},2]
[{"$f":"IF(ISERROR(Q!A4),\"\",Q!A4)","v":"Was COSI Part 1 performed?"},{"$f":"IF(ISERROR(Q!B4),\"\",Q!B4)","v":0},0.83333333333333337,{"$f":"'Jan-Data'!D10","v":0.83333333333333337},{"$f":"'Jan-Data'!D12","v":0},{"$f":"'Jan-Data'!D11","v":0.16666666666666666},2]
[{"$f":"IF(ISERROR(Q!A5),\"\",Q!A5)","v":"Was PVP documented?"},{"$f":"IF(ISERROR(Q!B5),\"\",Q!B5)","v":0},1,{"$f":"'Jan-Data'!E10","v":1},{"$f":"'Jan-Data'!E12","v":0},{"$f":"'Jan-Data'!E11","v":0},1]
[{"$f":"IF(ISERROR(Q!A6),\"\",Q!A6)","v":"Was Otoscopy documented?"},{"$f":"IF(ISERROR(Q!B6),\"\",Q!B6)","v":0},1,{"$f":"'Jan-Data'!F10","v":1},{"$f":"'Jan-Data'!F12","v":0},{"$f":"'Jan-Data'!F11","v":0},1]
[{"$f":"IF(ISERROR(Q!A7),\"\",Q!A7)","v":"Document bc at 3 & 4kHz is for programming purposes?"},{"$f":"IF(ISERROR(Q!B7),\"\",Q!B7)","v":0},1,{"$f":"'Jan-Data'!G10","v":1},{"$f":"'Jan-Data'!G12","v":0},{"$f":"'Jan-Data'!G11","v":0},1]
[{"$f":"IF(ISERROR(Q!A8),\"\",Q!A8)","v":"Was Speech testing performed?"},{"$f":"IF(ISERROR(Q!B8),\"\",Q!B8)","v":0},1,{"$f":"'Jan-Data'!H10","v":1},{"$f":"'Jan-Data'!H12","v":0},{"$f":"'Jan-Data'!H11","v":0},1]
[{"$f":"IF(ISERROR(Q!A9),\"\",Q!A9)","v":"Is it documented whether national criteria were/were not met?"},{"$f":"IF(ISERROR(Q!B9),\"\",Q!B9)","v":0},1,{"$f":"'Jan-Data'!I10","v":1},{"$f":"'Jan-Data'!I12","v":0},{"$f":"'Jan-Data'!I11","v":0},1]
[{"$f":"IF(ISERROR(Q!A10),\"\",Q!A10)","v":"Was a BCHI info pack supplied?"},{"$f":"IF(ISERROR(Q!B10),\"\",Q!B10)","v":0},1,{"$f":"'Jan-Data'!J10","v":1},{"$f":"'Jan-Data'!J12","v":0},{"$f":"'Jan-Data'!J11","v":0},1]
[{"$f":"IF(ISERROR(Q!A11),\"\",Q!A11)","v":"Was the report authorised & issued within target (7 days)?"},{"$f":"IF(ISERROR(Q!B11),\"\",Q!B11)","v":0},1,{"$f":"'Jan-Data'!K10","v":1},{"$f":"'Jan-Data'!K12","v":0},{"$f":"'Jan-Data'!K11","v":0},1]
[{"$f":"IF(ISERROR(Q!A12),\"\",Q!A12)","v":"Was consent documented as appropriate?"},{"$f":"IF(ISERROR(Q!B12),\"\",Q!B12)","v":0},1,{"$f":"'Jan-Data'!L10","v":1},{"$f":"'Jan-Data'!L12","v":0},{"$f":"'Jan-Data'!L11","v":0},1]
[{"$f":"IF(ISERROR(Q!A13),\"\",Q!A13)","v":0},{"$f":"IF(ISERROR(Q!B13),\"\",Q!B13)","v":0},"",{"$f":"'Jan-Data'!M10","v":""},{"$f":"'Jan-Data'!M12","v":""},{"$f":"'Jan-Data'!M11","v":""},0]
[{"$f":"IF(ISERROR(Q!A14),\"\",Q!A14)","v":0},{"$f":"IF(ISERROR(Q!B14),\"\",Q!B14)","v":0},"",{"$f":"'Jan-Data'!N10","v":""},{"$f":"'Jan-Data'!N12","v":""},{"$f":"'Jan-Data'!N11","v":""},0]
[{"$f":"IF(ISERROR(Q!A15),\"\",Q!A15)","v":0},{"$f":"IF(ISERROR(Q!B15),\"\",Q!B15)","v":0},"",{"$f":"'Jan-Data'!O10","v":""},{"$f":"'Jan-Data'!O12","v":""},{"$f":"'Jan-Data'!O11","v":""},0]
[{"$f":"IF(ISERROR(Q!A16),\"\",Q!A16)","v":0},{"$f":"IF(ISERROR(Q!B16),\"\",Q!B16)","v":0},"",{"$f":"'Jan-Data'!P10","v":""},{"$f":"'Jan-Data'!P12","v":""},{"$f":"'Jan-Data'!P11","v":""},0]
[{"$f":"IF(ISERROR(Q!A17),\"\",Q!A17)","v":0},{"$f":"IF(ISERROR(Q!B17),\"\",Q!B17)","v":0},"",{"$f":"'Jan-Data'!Q10","v":""},{"$f":"'Jan-Data'!Q12","v":""},{"$f":"'Jan-Data'!Q11","v":""},0]
[{"$f":"IF(ISERROR(Q!A18),\"\",Q!A18)","v":0},{"$f":"IF(ISERROR(Q!B18),\"\",Q!B18)","v":0},"",{"$f":"'Jan-Data'!R10","v":""},{"$f":"'Jan-Data'!R12","v":""},{"$f":"'Jan-Data'!R11","v":""},0]
[{"$f":"IF(ISERROR(Q!A19),\"\",Q!A19)","v":0},{"$f":"IF(ISERROR(Q!B19),\"\",Q!B19)","v":0},"",{"$f":"'Jan-Data'!S10","v":""},{"$f":"'Jan-Data'!S12","v":""},{"$f":"'Jan-Data'!S11","v":""},0]
[{"$f":"IF(ISERROR(Q!A20),\"\",Q!A20)","v":0},{"$f":"IF(ISERROR(Q!B20),\"\",Q!B20)","v":0},"",{"$f":"'Jan-Data'!T10","v":""},{"$f":"'Jan-Data'!T12","v":""},{"$f":"'Jan-Data'!T11","v":""},0]
[{"$f":"IF(ISERROR(Q!A21),\"\",Q!A21)","v":0},{"$f":"IF(ISERROR(Q!B21),\"\",Q!B21)","v":0},"",{"$f":"'Jan-Data'!U10","v":""},{"$f":"'Jan-Data'!U12","v":""},{"$f":"'Jan-Data'!U11","v":""},0]
[{"$f":"IF(ISERROR(Q!A22),\"\",Q!A22)","v":0},{"$f":"IF(ISERROR(Q!B22),\"\",Q!B22)","v":0},"",{"$f":"'Jan-Data'!V10","v":""},{"$f":"'Jan-Data'!V12","v":""},{"$f":"'Jan-Data'!V11","v":""},0]
[{"$f":"IF(ISERROR(Q!A23),\"\",Q!A23)","v":0},{"$f":"IF(ISERROR(Q!B23),\"\",Q!B23)","v":0},"",{"$f":"'Jan-Data'!W10","v":""},{"$f":"'Jan-Data'!W12","v":""},{"$f":"'Jan-Data'!W11","v":""},0]
[{"$f":"IF(ISERROR(Q!A24),\"\",Q!A24)","v":0},{"$f":"IF(ISERROR(Q!B24),\"\",Q!B24)","v":0},"",{"$f":"'Jan-Data'!X10","v":""},{"$f":"'Jan-Data'!X12","v":""},{"$f":"'Jan-Data'!X11","v":""},0]
[{"$f":"IF(ISERROR(Q!A25),\"\",Q!A25)","v":0},{"$f":"IF(ISERROR(Q!B25),\"\",Q!B25)","v":0},"",{"$f":"'Jan-Data'!Y10","v":""},{"$f":"'Jan-Data'!Y12","v":""},{"$f":"'Jan-Data'!Y11","v":""},0]
[{"$f":"IF(ISERROR(Q!A26),\"\",Q!A26)","v":0},{"$f":"IF(ISERROR(Q!B26),\"\",Q!B26)","v":0},"",{"$f":"'Jan-Data'!Z10","v":""},{"$f":"'Jan-Data'!Z12","v":""},{"$f":"'Jan-Data'!Z11","v":""},0]
[{"$f":"IF(ISERROR(Q!A27),\"\",Q!A27)","v":0},{"$f":"IF(ISERROR(Q!B27),\"\",Q!B27)","v":0},"",{"$f":"'Jan-Data'!AA10","v":""},{"$f":"'Jan-Data'!AA12","v":""},{"$f":"'Jan-Data'!AA11","v":""},0]
[{"$f":"IF(ISERROR(Q!A28),\"\",Q!A28)","v":0},{"$f":"IF(ISERROR(Q!B28),\"\",Q!B28)","v":0},"",{"$f":"'Jan-Data'!AB10","v":""},{"$f":"'Jan-Data'!AB12","v":""},{"$f":"'Jan-Data'!AB11","v":""},0]
[{"$f":"IF(ISERROR(Q!A29),\"\",Q!A29)","v":0},{"$f":"IF(ISERROR(Q!B29),\"\",Q!B29)","v":0},"",{"$f":"'Jan-Data'!AC10","v":""},{"$f":"'Jan-Data'!AC12","v":""},{"$f":"'Jan-Data'!AC11","v":""},0]
[{"$f":"IF(ISERROR(Q!A30),\"\",Q!A30)","v":0},{"$f":"IF(ISERROR(Q!B30),\"\",Q!B30)","v":0},"",{"$f":"'Jan-Data'!AD10","v":""},{"$f":"'Jan-Data'!AD12","v":""},{"$f":"'Jan-Data'!AD11","v":""},0]
[{"$f":"IF(ISERROR(Q!A31),\"\",Q!A31)","v":0},{"$f":"IF(ISERROR(Q!B31),\"\",Q!B31)","v":0},"",{"$f":"'Jan-Data'!AE10","v":""},{"$f":"'Jan-Data'!AE12","v":""},{"$f":"'Jan-Data'!AE11","v":""},0]
[{"$f":"IF(ISERROR(Q!A32),\"\",Q!A32)","v":0},{"$f":"IF(ISERROR(Q!B32),\"\",Q!B32)","v":0},"",{"$f":"'Jan-Data'!AF10","v":""},{"$f":"'Jan-Data'!AF12","v":""},{"$f":"'Jan-Data'!AF11","v":""},0]
[{"$f":"IF(ISERROR(Q!A33),\"\",Q!A33)","v":0},{"$f":"IF(ISERROR(Q!B33),\"\",Q!B33)","v":0},"",{"$f":"'Jan-Data'!AG10","v":""},{"$f":"'Jan-Data'!AG12","v":""},{"$f":"'Jan-Data'!AG11","v":""},0]
[{"$f":"IF(ISERROR(Q!A34),\"\",Q!A34)","v":0},{"$f":"IF(ISERROR(Q!B34),\"\",Q!B34)","v":0},"",{"$f":"'Jan-Data'!AH10","v":""},{"$f":"'Jan-Data'!AH12","v":""},{"$f":"'Jan-Data'!AH11","v":""},0]
[{"$f":"IF(ISERROR(Q!A35),\"\",Q!A35)","v":0},{"$f":"IF(ISERROR(Q!B35),\"\",Q!B35)","v":0},"",{"$f":"'Jan-Data'!AI10","v":""},{"$f":"'Jan-Data'!AI12","v":""},{"$f":"'Jan-Data'!AI11","v":""},0]
[{"$f":"IF(ISERROR(Q!A36),\"\",Q!A36)","v":0},{"$f":"IF(ISERROR(Q!B36),\"\",Q!B36)","v":0},"",{"$f":"'Jan-Data'!AJ10","v":""},{"$f":"'Jan-Data'!AJ12","v":""},{"$f":"'Jan-Data'!AJ11","v":""},0]
[{"$f":"IF(ISERROR(Q!A37),\"\",Q!A37)","v":0},{"$f":"IF(ISERROR(Q!B37),\"\",Q!B37)","v":0},"",{"$f":"'Jan-Data'!AK10","v":""},{"$f":"'Jan-Data'!AK12","v":""},{"$f":"'Jan-Data'!AK11","v":""},0]
[{"$f":"IF(ISERROR(Q!A38),\"\",Q!A38)","v":0},{"$f":"IF(ISERROR(Q!B38),\"\",Q!B38)","v":0},"",{"$f":"'Jan-Data'!AL10","v":""},{"$f":"'Jan-Data'!AL12","v":""},{"$f":"'Jan-Data'!AL11","v":""},0]
[{"$f":"IF(ISERROR(Q!A39),\"\",Q!A39)","v":0},{"$f":"IF(ISERROR(Q!B39),\"\",Q!B39)","v":0},"",{"$f":"'Jan-Data'!AM10","v":""},{"$f":"'Jan-Data'!AM12","v":""},{"$f":"'Jan-Data'!AM11","v":""},0]
[{"$f":"IF(ISERROR(Q!A40),\"\",Q!A40)","v":0},{"$f":"IF(ISERROR(Q!B40),\"\",Q!B40)","v":0},"",{"$f":"'Jan-Data'!AN10","v":""},{"$f":"'Jan-Data'!AN12","v":""},{"$f":"'Jan-Data'!AN11","v":""},0]
[{"$f":"IF(ISERROR(Q!A41),\"\",Q!A41)","v":0},{"$f":"IF(ISERROR(Q!B41),\"\",Q!B41)","v":0},"",{"$f":"'Jan-Data'!AO10","v":""},{"$f":"'Jan-Data'!AO12","v":""},{"$f":"'Jan-Data'!AO11","v":""},0]
[null,null,null,null,null,null,{"$f":"COUNTIF(G11:G50,\">=1\")","v":11}]

{"sheet":"Jan-Raw","index":34,"n_rows":8,"n_cols":87,"rows_kept":8,"cut":false,"hidden":true,"merged":[[0,85,0,86],[0,63,0,64],[0,65,0,66],[0,67,0,68],[0,69,0,70],[0,71,0,72],[0,73,0,74],[0,75,0,76],[0,77,0,78],[0,79,0,80],[0,81,0,82],[0,83,0,84],[0,61,0,62],[0,39,0,40],[0,41,0,42],[0,43,0,44],[0,45,0,46],[0,47,0,48],[0,49,0,50],[0,51,0,52],[0,53,0,54],[0,55,0,56],[0,57,0,58],[0,59,0,60],[0,37,0,38],[0,15,0,16],[0,17,0,18],[0,19,0,20],[0,21,0,22],[0,23,0,24],[0,25,0,26],[0,27,0,28],[0,29,0,30],[0,31,0,32],[0,33,0,34],[0,35,0,36],[0,13,0,14],[0,0,0,5],[0,6,1,6],[0,7,0,8],[0,9,0,10],[0,11,0,12]]}
["Record details",null,null,null,null,null,"Notes",{"$f":"Q!A2","v":"Was a Room number documented?"},null,{"$f":"Q!A3","v":"Were stage A checks completed as appropriate?"},null,{"$f":"Q!A4","v":"Was COSI Part 1 performed?"},null,{"$f":"Q!A5","v":"Was PVP documented?"},null,{"$f":"Q!A6","v":"Was Otoscopy documented?"},null,{"$f":"Q!A7","v":"Document bc at 3 & 4kHz is for programming purposes?"},null,{"$f":"Q!A8","v":"Was Speech testing performed?"},null,{"$f":"Q!A9","v":"Is it documented whether national criteria were/were not met?"},null,{"$f":"Q!A10","v":"Was a BCHI info pack supplied?"},null,{"$f":"Q!A11","v":"Was the report authorised & issued within target (7 days)?"},null,{"$f":"Q!A12","v":"Was consent documented as appropriate?"},null,{"$f":"Q!A13","v":0},null,{"$f":"Q!A14","v":0},null,{"$f":"Q!A15","v":0},null,{"$f":"Q!A16","v":0},null,{"$f":"Q!A17","v":0},null,{"$f":"Q!A18","v":0},null,{"$f":"Q!A19","v":0},null,{"$f":"Q!A20","v":0},null,{"$f":"Q!A21","v":0},null,{"$f":"Q!A22","v":0},null,{"$f":"Q!A23","v":0},null,{"$f":"Q!A24","v":0},null,{"$f":"Q!A25","v":0},null,{"$f":"Q!A26","v":0},null,{"$f":"Q!A27","v":0},null,{"$f":"Q!A28","v":0},null,{"$f":"Q!A29","v":0},null,{"$f":"Q!A30","v":0},null,{"$f":"Q!A31","v":0},null,{"$f":"Q!A32","v":0},null,{"$f":"Q!A33","v":0},null,{"$f":"Q!A34","v":0},null,{"$f":"Q!A35","v":0},null,{"$f":"Q!A36","v":0},null,{"$f":"Q!A37","v":0},null,{"$f":"Q!A38","v":0},null,{"$f":"Q!A39","v":0},null,{"$f":"Q!A40","v":0},null,{"$f":"Q!A41","v":0}]
["Pt number","Date seen","Clinician 1","clinician 2","New/ F-up","Apt code",null,"Compliant?","Other result","Compliant?","Other result","Compliant?","Other result","Compliant?","Other result","Compliant?","Other result","Compliant?","Other result","Compliant?","Other result","Compliant?","Other result","Compliant?","Other result","Compliant?","Other result","Compliant?","Other result","Compliant?","Other result","Compliant?","Other result","Compliant?","Other result","Compliant?","Other result","Compliant?","Other result","Compliant?","Other result","Compliant?","Other result","Compliant?","Other result","Compliant?","Other result","Compliant?","Other result","Compliant?","Other result","Compliant?","Other result","Compliant?","Other result","Compliant?","Other result","Compliant?","Other result","Compliant?","Other result","Compliant?","Other result","Compliant?","Other result","Compliant?","Other result","Compliant?","Other result","Compliant?","Other result","Compliant?","Other result","Compliant?","Other result","Compliant?","Other result","Compliant?","Other result","Compliant?","Other result","Compliant?","Other result","Compliant?","Other result","Compliant?","Other result"]
["AB0001","2023-01-01","AA",null,"New","BA",null,"Yes",null,"No",null,"Yes",null,"Yes",null,"Yes",null,"Yes",null,"Yes",null,"Yes",null,"Yes",null,"Yes",null,"Yes"]
["AB0002","2023-01-17","AA",null,"New","BA",null,"Yes",null,"Yes",null,"Yes",null,"Yes",null,"Yes",null,"Yes",null,"Yes",null,"Yes",null,"Yes",null,"Yes",null,"Yes"]
["AB0003","2023-01-24","BB",null,"New","BA",null,"Yes",null,"Yes",null,"Yes",null,"Yes",null,"Yes",null,"Yes",null,"Yes",null,"Yes",null,"Yes",null,"Yes",null,"Yes"]
["AB0011","2023-01-26","BB",null,"New","BA",null,"Yes",null,"Yes",null,"Yes",null,"Yes",null,"Yes",null,"Yes",null,"Yes",null,"Yes",null,"Yes",null,"Yes",null,"Yes"]
["AB0005","2023-01-28","CC",null,"New","BA",null,"Yes",null,"Yes",null,"Yes",null,"Yes",null,"Yes",null,"Yes",null,"Yes",null,"Yes",null,"Yes",null,"Yes",null,"Yes"]
["AB0006","2023-01-28","CC",null,"New","BA",null,"Yes",null,"Yes",null,"No",null,"Yes",null,"Yes",null,"Yes",null,"Yes",null,"Yes",null,"Yes",null,"Yes",null,"Yes"]

{"sheet":"Jan-Data","index":35,"n_rows":12,"n_cols":41,"rows_kept":12,"cut":false,"hidden":true,"merged":[[0,0,1,0]]}
["Results",{"$f":"Q!A2","v":"Was a Room number documented?"},{"$f":"Q!A3","v":"Were stage A checks completed as appropriate?"},{"$f":"Q!A4","v":"Was COSI Part 1 performed?"},{"$f":"Q!A5","v":"Was PVP documented?"},{"$f":"Q!A6","v":"Was Otoscopy documented?"},{"$f":"Q!A7","v":"Document bc at 3 & 4kHz is for programming purposes?"},{"$f":"Q!A8","v":"Was Speech testing performed?"},{"$f":"Q!A9","v":"Is it documented whether national criteria were/were not met?"},{"$f":"Q!A10","v":"Was a BCHI info pack supplied?"},{"$f":"Q!A11","v":"Was the report authorised & issued within target (7 days)?"},{"$f":"Q!A12","v":"Was consent documented as appropriate?"},{"$f":"Q!A13","v":0},{"$f":"Q!A14","v":0},{"$f":"Q!A15","v":0},{"$f":"Q!A16","v":0},{"$f":"Q!A17","v":0},{"$f":"Q!A18","v":0},{"$f":"Q!A19","v":0},{"$f":"Q!A20","v":0},{"$f":"Q!A21","v":0},{"$f":"Q!A22","v":0},{"$f":"Q!A23","v":0},{"$f":"Q!A24","v":0},{"$f":"Q!A25","v":0},{"$f":"Q!A26","v":0},{"$f":"Q!A27","v":0},{"$f":"Q!A28","v":0},{"$f":"Q!A29","v":0},{"$f":"Q!A30","v":0},{"$f":"Q!A31","v":0},{"$f":"Q!A32","v":0},{"$f":"Q!A33","v":0},{"$f":"Q!A34","v":0},{"$f":"Q!A35","v":0},{"$f":"Q!A36","v":0},{"$f":"Q!A37","v":0},{"$f":"Q!A38","v":0},{"$f":"Q!A39","v":0},{"$f":"Q!A40","v":0},{"$f":"Q!A41","v":0}]
[null,"Compliant?","Compliant?","Compliant?","Compliant?","Compliant?","Compliant?","Compliant?","Compliant?","Compliant?","Compliant?","Compliant?","Compliant?","Compliant?","Compliant?","Compliant?","Compliant?","Compliant?","Compliant?","Compliant?","Compliant?","Compliant?","Compliant?","Compliant?","Compliant?","Compliant?","Compliant?","Compliant?","Compliant?","Compliant?","Compliant?","Compliant?","Compliant?","Compliant?","Compliant?","Compliant?","Compliant?","Compliant?","Compliant?","Compliant?","Compliant?"]
["Total Y",{"$f":"COUNTIF('Jan-Raw'!H:H,\"yes\")","v":6},{"$f":"COUNTIF('Jan-Raw'!J:J,\"yes\")","v":5},{"$f":"COUNTIF('Jan-Raw'!L:L,\"yes\")","v":5},{"$f":"COUNTIF('Jan-Raw'!N:N,\"yes\")","v":6},{"$f":"COUNTIF('Jan-Raw'!P:P,\"yes\")","v":6},{"$f":"COUNTIF('Jan-Raw'!R:R,\"yes\")","v":6},{"$f":"COUNTIF('Jan-Raw'!T:T,\"yes\")","v":6},{"$f":"COUNTIF('Jan-Raw'!V:V,\"yes\")","v":6},{"$f":"COUNTIF('Jan-Raw'!X:X,\"yes\")","v":6},{"$f":"COUNTIF('Jan-Raw'!Z:Z,\"yes\")","v":6},{"$f":"COUNTIF('Jan-Raw'!AB:AB,\"yes\")","v":6},{"$f":"COUNTIF('Jan-Raw'!AD:AD,\"yes\")","v":0},{"$f":"COUNTIF('Jan-Raw'!AF:AF,\"yes\")","v":0},{"$f":"COUNTIF('Jan-Raw'!AH:AH,\"yes\")","v":0},{"$f":"COUNTIF('Jan-Raw'!AJ:AJ,\"yes\")","v":0},{"$f":"COUNTIF('Jan-Raw'!AL:AL,\"yes\")","v":0},{"$f":"COUNTIF('Jan-Raw'!AN:AN,\"yes\")","v":0},{"$f":"COUNTIF('Jan-Raw'!AP:AP,\"yes\")","v":0},{"$f":"COUNTIF('Jan-Raw'!AR:AR,\"yes\")","v":0},{"$f":"COUNTIF('Jan-Raw'!AT:AT,\"yes\")","v":0},{"$f":"COUNTIF('Jan-Raw'!AV:AV,\"yes\")","v":0},{"$f":"COUNTIF('Jan-Raw'!AX:AX,\"yes\")","v":0},{"$f":"COUNTIF('Jan-Raw'!AZ:AZ,\"yes\")","v":0},{"$f":"COUNTIF('Jan-Raw'!BB:BB,\"yes\")","v":0},{"$f":"COUNTIF('Jan-Raw'!BD:BD,\"yes\")","v":0},{"$f":"COUNTIF('Jan-Raw'!BF:BF,\"yes\")","v":0},{"$f":"COUNTIF('Jan-Raw'!BH:BH,\"yes\")","v":0},{"$f":"COUNTIF('Jan-Raw'!BJ:BJ,\"yes\")","v":0},{"$f":"COUNTIF('Jan-Raw'!BL:BL,\"yes\")","v":0},{"$f":"COUNTIF('Jan-Raw'!BN:BN,\"yes\")","v":0},{"$f":"COUNTIF('Jan-Raw'!BP:BP,\"yes\")","v":0},{"$f":"COUNTIF('Jan-Raw'!BR:BR,\"yes\")","v":0},{"$f":"COUNTIF('Jan-Raw'!BT:BT,\"yes\")","v":0},{"$f":"COUNTIF('Jan-Raw'!BV:BV,\"yes\")","v":0},{"$f":"COUNTIF('Jan-Raw'!BX:BX,\"yes\")","v":0},{"$f":"COUNTIF('Jan-Raw'!BZ:BZ,\"yes\")","v":0},{"$f":"COUNTIF('Jan-Raw'!CB:CB,\"yes\")","v":0},{"$f":"COUNTIF('Jan-Raw'!CD:CD,\"yes\")","v":0},{"$f":"COUNTIF('Jan-Raw'!CF:CF,\"yes\")","v":0},{"$f":"COUNTIF('Jan-Raw'!CH:CH,\"yes\")","v":0}]
["Total N",{"$f":"COUNTIF('Jan-Raw'!H:H,\"no\")","v":0},{"$f":"COUNTIF('Jan-Raw'!J:J,\"no\")","v":1},{"$f":"COUNTIF('Jan-Raw'!L:L,\"no\")","v":1},{"$f":"COUNTIF('Jan-Raw'!N:N,\"no\")","v":0},{"$f":"COUNTIF('Jan-Raw'!P:P,\"no\")","v":0},{"$f":"COUNTIF('Jan-Raw'!R:R,\"no\")","v":0},{"$f":"COUNTIF('Jan-Raw'!T:T,\"no\")","v":0},{"$f":"COUNTIF('Jan-Raw'!V:V,\"no\")","v":0},{"$f":"COUNTIF('Jan-Raw'!X:X,\"no\")","v":0},{"$f":"COUNTIF('Jan-Raw'!Z:Z,\"no\")","v":0},{"$f":"COUNTIF('Jan-Raw'!AB:AB,\"no\")","v":0},{"$f":"COUNTIF('Jan-Raw'!AD:AD,\"no\")","v":0},{"$f":"COUNTIF('Jan-Raw'!AF:AF,\"no\")","v":0},{"$f":"COUNTIF('Jan-Raw'!AH:AH,\"no\")","v":0},{"$f":"COUNTIF('Jan-Raw'!AJ:AJ,\"no\")","v":0},{"$f":"COUNTIF('Jan-Raw'!AL:AL,\"no\")","v":0},{"$f":"COUNTIF('Jan-Raw'!AN:AN,\"no\")","v":0},{"$f":"COUNTIF('Jan-Raw'!AP:AP,\"no\")","v":0},{"$f":"COUNTIF('Jan-Raw'!AR:AR,\"no\")","v":0},{"$f":"COUNTIF('Jan-Raw'!AT:AT,\"no\")","v":0},{"$f":"COUNTIF('Jan-Raw'!AV:AV,\"no\")","v":0},{"$f":"COUNTIF('Jan-Raw'!AX:AX,\"no\")","v":0},{"$f":"COUNTIF('Jan-Raw'!AZ:AZ,\"no\")","v":0},{"$f":"COUNTIF('Jan-Raw'!BB:BB,\"no\")","v":0},{"$f":"COUNTIF('Jan-Raw'!BD:BD,\"no\")","v":0},{"$f":"COUNTIF('Jan-Raw'!BF:BF,\"no\")","v":0},{"$f":"COUNTIF('Jan-Raw'!BH:BH,\"no\")","v":0},{"$f":"COUNTIF('Jan-Raw'!BJ:BJ,\"no\")","v":0},{"$f":"COUNTIF('Jan-Raw'!BL:BL,\"no\")","v":0},{"$f":"COUNTIF('Jan-Raw'!BN:BN,\"no\")","v":0},{"$f":"COUNTIF('Jan-Raw'!BP:BP,\"no\")","v":0},{"$f":"COUNTIF('Jan-Raw'!BR:BR,\"no\")","v":0},{"$f":"COUNTIF('Jan-Raw'!BT:BT,\"no\")","v":0},{"$f":"COUNTIF('Jan-Raw'!BV:BV,\"no\")","v":0},{"$f":"COUNTIF('Jan-Raw'!BX:BX,\"no\")","v":0},{"$f":"COUNTIF('Jan-Raw'!BZ:BZ,\"no\")","v":0},{"$f":"COUNTIF('Jan-Raw'!CB:CB,\"no\")","v":0},{"$f":"COUNTIF('Jan-Raw'!CD:CD,\"no\")","v":0},{"$f":"COUNTIF('Jan-Raw'!CF:CF,\"no\")","v":0},{"$f":"COUNTIF('Jan-Raw'!CH:CH,\"no\")","v":0}]
["Total Justified",{"$f":"COUNTIF('Jan-Raw'!H:H,\"Justified\")","v":0},{"$f":"COUNTIF('Jan-Raw'!J:J,\"Justified\")","v":0},{"$f":"COUNTIF('Jan-Raw'!L:L,\"Justified\")","v":0},{"$f":"COUNTIF('Jan-Raw'!N:N,\"Justified\")","v":0},{"$f":"COUNTIF('Jan-Raw'!P:P,\"Justified\")","v":0},{"$f":"COUNTIF('Jan-Raw'!R:R,\"Justified\")","v":0},{"$f":"COUNTIF('Jan-Raw'!T:T,\"Justified\")","v":0},{"$f":"COUNTIF('Jan-Raw'!V:V,\"Justified\")","v":0},{"$f":"COUNTIF('Jan-Raw'!X:X,\"Justified\")","v":0},{"$f":"COUNTIF('Jan-Raw'!Z:Z,\"Justified\")","v":0},{"$f":"COUNTIF('Jan-Raw'!AB:AB,\"Justified\")","v":0},{"$f":"COUNTIF('Jan-Raw'!AD:AD,\"Justified\")","v":0},{"$f":"COUNTIF('Jan-Raw'!AF:AF,\"Justified\")","v":0},{"$f":"COUNTIF('Jan-Raw'!AH:AH,\"Justified\")","v":0},{"$f":"COUNTIF('Jan-Raw'!AJ:AJ,\"Justified\")","v":0},{"$f":"COUNTIF('Jan-Raw'!AL:AL,\"Justified\")","v":0},{"$f":"COUNTIF('Jan-Raw'!AN:AN,\"Justified\")","v":0},{"$f":"COUNTIF('Jan-Raw'!AP:AP,\"Justified\")","v":0},{"$f":"COUNTIF('Jan-Raw'!AR:AR,\"Justified\")","v":0},{"$f":"COUNTIF('Jan-Raw'!AT:AT,\"Justified\")","v":0},{"$f":"COUNTIF('Jan-Raw'!AV:AV,\"Justified\")","v":0},{"$f":"COUNTIF('Jan-Raw'!AX:AX,\"Justified\")","v":0},{"$f":"COUNTIF('Jan-Raw'!AZ:AZ,\"Justified\")","v":0},{"$f":"COUNTIF('Jan-Raw'!BB:BB,\"Justified\")","v":0},{"$f":"COUNTIF('Jan-Raw'!BD:BD,\"Justified\")","v":0},{"$f":"COUNTIF('Jan-Raw'!BF:BF,\"Justified\")","v":0},{"$f":"COUNTIF('Jan-Raw'!BH:BH,\"Justified\")","v":0},{"$f":"COUNTIF('Jan-Raw'!BJ:BJ,\"Justified\")","v":0},{"$f":"COUNTIF('Jan-Raw'!BL:BL,\"Justified\")","v":0},{"$f":"COUNTIF('Jan-Raw'!BN:BN,\"Justified\")","v":0},{"$f":"COUNTIF('Jan-Raw'!BP:BP,\"Justified\")","v":0},{"$f":"COUNTIF('Jan-Raw'!BR:BR,\"Justified\")","v":0},{"$f":"COUNTIF('Jan-Raw'!BT:BT,\"Justified\")","v":0},{"$f":"COUNTIF('Jan-Raw'!BV:BV,\"Justified\")","v":0},{"$f":"COUNTIF('Jan-Raw'!BX:BX,\"Justified\")","v":0},{"$f":"COUNTIF('Jan-Raw'!BZ:BZ,\"Justified\")","v":0},{"$f":"COUNTIF('Jan-Raw'!CB:CB,\"Justified\")","v":0},{"$f":"COUNTIF('Jan-Raw'!CD:CD,\"Justified\")","v":0},{"$f":"COUNTIF('Jan-Raw'!CF:CF,\"Justified\")","v":0},{"$f":"COUNTIF('Jan-Raw'!CH:CH,\"Justified\")","v":0}]
["Total NA",{"$f":"COUNTIF('Jan-Raw'!H:H,\"NA\")","v":0},{"$f":"COUNTIF('Jan-Raw'!J:J,\"NA\")","v":0},{"$f":"COUNTIF('Jan-Raw'!L:L,\"NA\")","v":0},{"$f":"COUNTIF('Jan-Raw'!N:N,\"NA\")","v":0},{"$f":"COUNTIF('Jan-Raw'!P:P,\"NA\")","v":0},{"$f":"COUNTIF('Jan-Raw'!R:R,\"NA\")","v":0},{"$f":"COUNTIF('Jan-Raw'!T:T,\"NA\")","v":0},{"$f":"COUNTIF('Jan-Raw'!V:V,\"NA\")","v":0},{"$f":"COUNTIF('Jan-Raw'!X:X,\"NA\")","v":0},{"$f":"COUNTIF('Jan-Raw'!Z:Z,\"NA\")","v":0},{"$f":"COUNTIF('Jan-Raw'!AB:AB,\"NA\")","v":0},{"$f":"COUNTIF('Jan-Raw'!AD:AD,\"NA\")","v":0},{"$f":"COUNTIF('Jan-Raw'!AF:AF,\"NA\")","v":0},{"$f":"COUNTIF('Jan-Raw'!AH:AH,\"NA\")","v":0},{"$f":"COUNTIF('Jan-Raw'!AJ:AJ,\"NA\")","v":0},{"$f":"COUNTIF('Jan-Raw'!AL:AL,\"NA\")","v":0},{"$f":"COUNTIF('Jan-Raw'!AN:AN,\"NA\")","v":0},{"$f":"COUNTIF('Jan-Raw'!AP:AP,\"NA\")","v":0},{"$f":"COUNTIF('Jan-Raw'!AR:AR,\"NA\")","v":0},{"$f":"COUNTIF('Jan-Raw'!AT:AT,\"NA\")","v":0},{"$f":"COUNTIF('Jan-Raw'!AV:AV,\"NA\")","v":0},{"$f":"COUNTIF('Jan-Raw'!AX:AX,\"NA\")","v":0},{"$f":"COUNTIF('Jan-Raw'!AZ:AZ,\"NA\")","v":0},{"$f":"COUNTIF('Jan-Raw'!BB:BB,\"NA\")","v":0},{"$f":"COUNTIF('Jan-Raw'!BD:BD,\"NA\")","v":0},{"$f":"COUNTIF('Jan-Raw'!BF:BF,\"NA\")","v":0},{"$f":"COUNTIF('Jan-Raw'!BH:BH,\"NA\")","v":0},{"$f":"COUNTIF('Jan-Raw'!BJ:BJ,\"NA\")","v":0},{"$f":"COUNTIF('Jan-Raw'!BL:BL,\"NA\")","v":0},{"$f":"COUNTIF('Jan-Raw'!BN:BN,\"NA\")","v":0},{"$f":"COUNTIF('Jan-Raw'!BP:BP,\"NA\")","v":0},{"$f":"COUNTIF('Jan-Raw'!BR:BR,\"NA\")","v":0},{"$f":"COUNTIF('Jan-Raw'!BT:BT,\"NA\")","v":0},{"$f":"COUNTIF('Jan-Raw'!BV:BV,\"NA\")","v":0},{"$f":"COUNTIF('Jan-Raw'!BX:BX,\"NA\")","v":0},{"$f":"COUNTIF('Jan-Raw'!BZ:BZ,\"NA\")","v":0},{"$f":"COUNTIF('Jan-Raw'!CB:CB,\"NA\")","v":0},{"$f":"COUNTIF('Jan-Raw'!CD:CD,\"NA\")","v":0},{"$f":"COUNTIF('Jan-Raw'!CF:CF,\"NA\")","v":0},{"$f":"COUNTIF('Jan-Raw'!CH:CH,\"NA\")","v":0}]
["Blanks",{"$f":"B8-(SUM(B3:B6))","v":0},{"$f":"C8-(SUM(C3:C6))","v":0},0,0,0,0,0,0,0,0,0,6,6,6,6,6,6,6,6,6,6,6,6,6,6,6,6,6,6,6,6,6,6,6,6,6,6,6,6,6]
["full sample size",{"$f":"COUNTA('Jan-Raw'!A:A)-2","v":6},{"$f":"B8","v":6},6,6,6,6,6,6,6,6,6,6,6,6,6,6,6,6,6,6,6,6,6,6,6,6,6,6,6,6,6,6,6,6,6,6,6,6,6,6]
["True sample size (-NA + blanks)",{"$f":"IF(ISERROR(B8-(B6+B7)),\"\",B8-(B6+B7))","v":6},{"$f":"IF(ISERROR(C8-(C6+C7)),\"\",C8-(C6+C7))","v":6},6,6,6,6,6,6,6,6,6,0,0,0,0,0,0,0,0,0,0,0,0,0,0,0,0,0,0,0,0,0,0,0,0,0,0,0,0,0]
["%Y",{"$f":"IF(ISERROR(B3/B9),\"\",B3/B9)","v":1},{"$f":"IF(ISERROR(C3/C9),\"\",C3/C9)","v":0.83333333333333337},0.83333333333333337,1,1,1,1,1,1,1,1,"","","","","","","","","","","","","","","","","","","","","","","","","","","","",""]
["%N",{"$f":"IF(ISERROR(B4/B9),\"\",B4/B9)","v":0},{"$f":"IF(ISERROR(C4/C9),\"\",C4/C9)","v":0.16666666666666666},0.16666666666666666,0,0,0,0,0,0,0,0,"","","","","","","","","","","","","","","","","","","","","","","","","","","","",""]
["%N - Justified",{"$f":"IF(ISERROR(B5/B9),\"\",B5/B9)","v":0},{"$f":"IF(ISERROR(C5/C9),\"\",C5/C9)","v":0},0,0,0,0,0,0,0,0,0,"","","","","","","","","","","","","","","","","","","","","","","","","","","","",""]

{"sheet":"Feb","index":36,"n_rows":51,"n_cols":8,"rows_kept":51,"cut":false,"hidden":false,"merged":[]}
["Click here to go to year overview"]
[]
["Date",null,null,"Total by Apt type"]
["Completed by",null,null,"New",{"$f":"COUNTIF('feb-Raw'!E3:E103,\"New\")","v":5}]
["Sample group size",{"$f":"COUNTA('feb-Raw'!A:A)-2","v":5},null,"Follow up",{"$f":"COUNTIF('feb-Raw'!E3:E103,\"Fup\")","v":0},null,null,{"$f":"Year!H5","v":0.95}]
["Overall Result (compliant only)",{"$f":"IF(ISERROR(SUM(D11:D50)/G51),\"\",SUM(D11:D50)/G51)","v":0.94090909090909092},null,"Total by apt Code",null,null,null,{"$f":"Year!H6","v":"80-95%"}]
["Overall Result (compliant & Justified)",{"$f":"IF(ISERROR(SUM(C11:C50)/G51),\"\",SUM(C11:C50)/G51)","v":0.94090909090909092},null,"code goes in here",{"$f":"COUNTIF('feb-Raw'!F3:F103,D7)","v":0},null,null,{"$f":"Year!H7","v":0.8}]
["viable qs",{"$f":"G51","v":11}]
[]
["Metric","Target %","Compliant + Justified","Compliant","Justified","Not compliant","Irritating math"]
[{"$f":"IF(ISERROR(Q!A2),\"\",Q!A2)","v":"Was a Room number documented?"},{"$f":"IF(ISERROR(Q!B2),\"\",Q!B2)","v":0},{"$f":"IF(ISERROR(D11+E11),\"\",D11+E11)","v":0.8},{"$f":"'feb-Data'!B10","v":0.8},{"$f":"'feb-Data'!B12","v":0},{"$f":"'feb-Data'!B11","v":0.2},{"$f":"COUNTIF(D11:F11,\">0\")","v":2}]
[{"$f":"IF(ISERROR(Q!A3),\"\",Q!A3)","v":"Were stage A checks completed as appropriate?"},{"$f":"IF(ISERROR(Q!B3),\"\",Q!B3)","v":0},0.75,{"$f":"'feb-Data'!C10","v":0.75},{"$f":"'feb-Data'!C12","v":0},{"$f":"'feb-Data'!C11","v":0.25},2]
[{"$f":"IF(ISERROR(Q!A4),\"\",Q!A4)","v":"Was COSI Part 1 performed?"},{"$f":"IF(ISERROR(Q!B4),\"\",Q!B4)","v":0},1,{"$f":"'feb-Data'!D10","v":1},{"$f":"'feb-Data'!D12","v":0},{"$f":"'feb-Data'!D11","v":0},1]
[{"$f":"IF(ISERROR(Q!A5),\"\",Q!A5)","v":"Was PVP documented?"},{"$f":"IF(ISERROR(Q!B5),\"\",Q!B5)","v":0},1,{"$f":"'feb-Data'!E10","v":1},{"$f":"'feb-Data'!E12","v":0},{"$f":"'feb-Data'!E11","v":0},1]
[{"$f":"IF(ISERROR(Q!A6),\"\",Q!A6)","v":"Was Otoscopy documented?"},{"$f":"IF(ISERROR(Q!B6),\"\",Q!B6)","v":0},0.8,{"$f":"'feb-Data'!F10","v":0.8},{"$f":"'feb-Data'!F12","v":0},{"$f":"'feb-Data'!F11","v":0.2},2]
[{"$f":"IF(ISERROR(Q!A7),\"\",Q!A7)","v":"Document bc at 3 & 4kHz is for programming purposes?"},{"$f":"IF(ISERROR(Q!B7),\"\",Q!B7)","v":0},1,{"$f":"'feb-Data'!G10","v":1},{"$f":"'feb-Data'!G12","v":0},{"$f":"'feb-Data'!G11","v":0},1]
[{"$f":"IF(ISERROR(Q!A8),\"\",Q!A8)","v":"Was Speech testing performed?"},{"$f":"IF(ISERROR(Q!B8),\"\",Q!B8)","v":0},1,{"$f":"'feb-Data'!H10","v":1},{"$f":"'feb-Data'!H12","v":0},{"$f":"'feb-Data'!H11","v":0},1]
[{"$f":"IF(ISERROR(Q!A9),\"\",Q!A9)","v":"Is it documented whether national criteria were/were not met?"},{"$f":"IF(ISERROR(Q!B9),\"\",Q!B9)","v":0},1,{"$f":"'feb-Data'!I10","v":1},{"$f":"'feb-Data'!I12","v":0},{"$f":"'feb-Data'!I11","v":0},1]
[{"$f":"IF(ISERROR(Q!A10),\"\",Q!A10)","v":"Was a BCHI info pack supplied?"},{"$f":"IF(ISERROR(Q!B10),\"\",Q!B10)","v":0},1,{"$f":"'feb-Data'!J10","v":1},{"$f":"'feb-Data'!J12","v":0},{"$f":"'feb-Data'!J11","v":0},1]
[{"$f":"IF(ISERROR(Q!A11),\"\",Q!A11)","v":"Was the report authorised & issued within target (7 days)?"},{"$f":"IF(ISERROR(Q!B11),\"\",Q!B11)","v":0},1,{"$f":"'feb-Data'!K10","v":1},{"$f":"'feb-Data'!K12","v":0},{"$f":"'feb-Data'!K11","v":0},1]
[{"$f":"IF(ISERROR(Q!A12),\"\",Q!A12)","v":"Was consent documented as appropriate?"},{"$f":"IF(ISERROR(Q!B12),\"\",Q!B12)","v":0},1,{"$f":"'feb-Data'!L10","v":1},{"$f":"'feb-Data'!L12","v":0},{"$f":"'feb-Data'!L11","v":0},1]
[{"$f":"IF(ISERROR(Q!A13),\"\",Q!A13)","v":0},{"$f":"IF(ISERROR(Q!B13),\"\",Q!B13)","v":0},"",{"$f":"'feb-Data'!M10","v":""},{"$f":"'feb-Data'!M12","v":""},{"$f":"'feb-Data'!M11","v":""},0]
[{"$f":"IF(ISERROR(Q!A14),\"\",Q!A14)","v":0},{"$f":"IF(ISERROR(Q!B14),\"\",Q!B14)","v":0},"",{"$f":"'feb-Data'!N10","v":""},{"$f":"'feb-Data'!N12","v":""},{"$f":"'feb-Data'!N11","v":""},0]
[{"$f":"IF(ISERROR(Q!A15),\"\",Q!A15)","v":0},{"$f":"IF(ISERROR(Q!B15),\"\",Q!B15)","v":0},"",{"$f":"'feb-Data'!O10","v":""},{"$f":"'feb-Data'!O12","v":""},{"$f":"'feb-Data'!O11","v":""},0]
[{"$f":"IF(ISERROR(Q!A16),\"\",Q!A16)","v":0},{"$f":"IF(ISERROR(Q!B16),\"\",Q!B16)","v":0},"",{"$f":"'feb-Data'!P10","v":""},{"$f":"'feb-Data'!P12","v":""},{"$f":"'feb-Data'!P11","v":""},0]
[{"$f":"IF(ISERROR(Q!A17),\"\",Q!A17)","v":0},{"$f":"IF(ISERROR(Q!B17),\"\",Q!B17)","v":0},"",{"$f":"'feb-Data'!Q10","v":""},{"$f":"'feb-Data'!Q12","v":""},{"$f":"'feb-Data'!Q11","v":""},0]
[{"$f":"IF(ISERROR(Q!A18),\"\",Q!A18)","v":0},{"$f":"IF(ISERROR(Q!B18),\"\",Q!B18)","v":0},"",{"$f":"'feb-Data'!R10","v":""},{"$f":"'feb-Data'!R12","v":""},{"$f":"'feb-Data'!R11","v":""},0]
[{"$f":"IF(ISERROR(Q!A19),\"\",Q!A19)","v":0},{"$f":"IF(ISERROR(Q!B19),\"\",Q!B19)","v":0},"",{"$f":"'feb-Data'!S10","v":""},{"$f":"'feb-Data'!S12","v":""},{"$f":"'feb-Data'!S11","v":""},0]
[{"$f":"IF(ISERROR(Q!A20),\"\",Q!A20)","v":0},{"$f":"IF(ISERROR(Q!B20),\"\",Q!B20)","v":0},"",{"$f":"'feb-Data'!T10","v":""},{"$f":"'feb-Data'!T12","v":""},{"$f":"'feb-Data'!T11","v":""},0]
[{"$f":"IF(ISERROR(Q!A21),\"\",Q!A21)","v":0},{"$f":"IF(ISERROR(Q!B21),\"\",Q!B21)","v":0},"",{"$f":"'feb-Data'!U10","v":""},{"$f":"'feb-Data'!U12","v":""},{"$f":"'feb-Data'!U11","v":""},0]
[{"$f":"IF(ISERROR(Q!A22),\"\",Q!A22)","v":0},{"$f":"IF(ISERROR(Q!B22),\"\",Q!B22)","v":0},"",{"$f":"'feb-Data'!V10","v":""},{"$f":"'feb-Data'!V12","v":""},{"$f":"'feb-Data'!V11","v":""},0]
[{"$f":"IF(ISERROR(Q!A23),\"\",Q!A23)","v":0},{"$f":"IF(ISERROR(Q!B23),\"\",Q!B23)","v":0},"",{"$f":"'feb-Data'!W10","v":""},{"$f":"'feb-Data'!W12","v":""},{"$f":"'feb-Data'!W11","v":""},0]
[{"$f":"IF(ISERROR(Q!A24),\"\",Q!A24)","v":0},{"$f":"IF(ISERROR(Q!B24),\"\",Q!B24)","v":0},"",{"$f":"'feb-Data'!X10","v":""},{"$f":"'feb-Data'!X12","v":""},{"$f":"'feb-Data'!X11","v":""},0]
[{"$f":"IF(ISERROR(Q!A25),\"\",Q!A25)","v":0},{"$f":"IF(ISERROR(Q!B25),\"\",Q!B25)","v":0},"",{"$f":"'feb-Data'!Y10","v":""},{"$f":"'feb-Data'!Y12","v":""},{"$f":"'feb-Data'!Y11","v":""},0]
[{"$f":"IF(ISERROR(Q!A26),\"\",Q!A26)","v":0},{"$f":"IF(ISERROR(Q!B26),\"\",Q!B26)","v":0},"",{"$f":"'feb-Data'!Z10","v":""},{"$f":"'feb-Data'!Z12","v":""},{"$f":"'feb-Data'!Z11","v":""},0]
[{"$f":"IF(ISERROR(Q!A27),\"\",Q!A27)","v":0},{"$f":"IF(ISERROR(Q!B27),\"\",Q!B27)","v":0},"",{"$f":"'feb-Data'!AA10","v":""},{"$f":"'feb-Data'!AA12","v":""},{"$f":"'feb-Data'!AA11","v":""},0]
[{"$f":"IF(ISERROR(Q!A28),\"\",Q!A28)","v":0},{"$f":"IF(ISERROR(Q!B28),\"\",Q!B28)","v":0},"",{"$f":"'feb-Data'!AB10","v":""},{"$f":"'feb-Data'!AB12","v":""},{"$f":"'feb-Data'!AB11","v":""},0]
[{"$f":"IF(ISERROR(Q!A29),\"\",Q!A29)","v":0},{"$f":"IF(ISERROR(Q!B29),\"\",Q!B29)","v":0},"",{"$f":"'feb-Data'!AC10","v":""},{"$f":"'feb-Data'!AC12","v":""},{"$f":"'feb-Data'!AC11","v":""},0]
[{"$f":"IF(ISERROR(Q!A30),\"\",Q!A30)","v":0},{"$f":"IF(ISERROR(Q!B30),\"\",Q!B30)","v":0},"",{"$f":"'feb-Data'!AD10","v":""},{"$f":"'feb-Data'!AD12","v":""},{"$f":"'feb-Data'!AD11","v":""},0]
[{"$f":"IF(ISERROR(Q!A31),\"\",Q!A31)","v":0},{"$f":"IF(ISERROR(Q!B31),\"\",Q!B31)","v":0},"",{"$f":"'feb-Data'!AE10","v":""},{"$f":"'feb-Data'!AE12","v":""},{"$f":"'feb-Data'!AE11","v":""},0]
[{"$f":"IF(ISERROR(Q!A32),\"\",Q!A32)","v":0},{"$f":"IF(ISERROR(Q!B32),\"\",Q!B32)","v":0},"",{"$f":"'feb-Data'!AF10","v":""},{"$f":"'feb-Data'!AF12","v":""},{"$f":"'feb-Data'!AF11","v":""},0]
[{"$f":"IF(ISERROR(Q!A33),\"\",Q!A33)","v":0},{"$f":"IF(ISERROR(Q!B33),\"\",Q!B33)","v":0},"",{"$f":"'feb-Data'!AG10","v":""},{"$f":"'feb-Data'!AG12","v":""},{"$f":"'feb-Data'!AG11","v":""},0]
[{"$f":"IF(ISERROR(Q!A34),\"\",Q!A34)","v":0},{"$f":"IF(ISERROR(Q!B34),\"\",Q!B34)","v":0},"",{"$f":"'feb-Data'!AH10","v":""},{"$f":"'feb-Data'!AH12","v":""},{"$f":"'feb-Data'!AH11","v":""},0]
[{"$f":"IF(ISERROR(Q!A35),\"\",Q!A35)","v":0},{"$f":"IF(ISERROR(Q!B35),\"\",Q!B35)","v":0},"",{"$f":"'feb-Data'!AI10","v":""},{"$f":"'feb-Data'!AI12","v":""},{"$f":"'feb-Data'!AI11","v":""},0]
[{"$f":"IF(ISERROR(Q!A36),\"\",Q!A36)","v":0},{"$f":"IF(ISERROR(Q!B36),\"\",Q!B36)","v":0},"",{"$f":"'feb-Data'!AJ10","v":""},{"$f":"'feb-Data'!AJ12","v":""},{"$f":"'feb-Data'!AJ11","v":""},0]
[{"$f":"IF(ISERROR(Q!A37),\"\",Q!A37)","v":0},{"$f":"IF(ISERROR(Q!B37),\"\",Q!B37)","v":0},"",{"$f":"'feb-Data'!AK10","v":""},{"$f":"'feb-Data'!AK12","v":""},{"$f":"'feb-Data'!AK11","v":""},0]
[{"$f":"IF(ISERROR(Q!A38),\"\",Q!A38)","v":0},{"$f":"IF(ISERROR(Q!B38),\"\",Q!B38)","v":0},"",{"$f":"'feb-Data'!AL10","v":""},{"$f":"'feb-Data'!AL12","v":""},{"$f":"'feb-Data'!AL11","v":""},0]
[{"$f":"IF(ISERROR(Q!A39),\"\",Q!A39)","v":0},{"$f":"IF(ISERROR(Q!B39),\"\",Q!B39)","v":0},"",{"$f":"'feb-Data'!AM10","v":""},{"$f":"'feb-Data'!AM12","v":""},{"$f":"'feb-Data'!AM11","v":""},0]
[{"$f":"IF(ISERROR(Q!A40),\"\",Q!A40)","v":0},{"$f":"IF(ISERROR(Q!B40),\"\",Q!B40)","v":0},"",{"$f":"'feb-Data'!AN10","v":""},{"$f":"'feb-Data'!AN12","v":""},{"$f":"'feb-Data'!AN11","v":""},0]
[{"$f":"IF(ISERROR(Q!A41),\"\",Q!A41)","v":0},{"$f":"IF(ISERROR(Q!B41),\"\",Q!B41)","v":0},"",{"$f":"'feb-Data'!AO10","v":""},{"$f":"'feb-Data'!AO12","v":""},{"$f":"'feb-Data'!AO11","v":""},0]
[null,null,null,null,null,null,{"$f":"COUNTIF(G11:G50,\">=1\")","v":11}]

{"sheet":"feb-Raw","index":37,"n_rows":7,"n_cols":87,"rows_kept":7,"cut":false,"hidden":true,"merged":[[0,85,0,86],[0,63,0,64],[0,65,0,66],[0,67,0,68],[0,69,0,70],[0,71,0,72],[0,73,0,74],[0,75,0,76],[0,77,0,78],[0,79,0,80],[0,81,0,82],[0,83,0,84],[0,61,0,62],[0,39,0,40],[0,41,0,42],[0,43,0,44],[0,45,0,46],[0,47,0,48],[0,49,0,50],[0,51,0,52],[0,53,0,54],[0,55,0,56],[0,57,0,58],[0,59,0,60],[0,37,0,38],[0,15,0,16],[0,17,0,18],[0,19,0,20],[0,21,0,22],[0,23,0,24],[0,25,0,26],[0,27,0,28],[0,29,0,30],[0,31,0,32],[0,33,0,34],[0,35,0,36],[0,13,0,14],[0,0,0,5],[0,6,1,6],[0,7,0,8],[0,9,0,10],[0,11,0,12]]}
["Record details",null,null,null,null,null,"Notes",{"$f":"Q!A2","v":"Was a Room number documented?"},null,{"$f":"Q!A3","v":"Were stage A checks completed as appropriate?"},null,{"$f":"Q!A4","v":"Was COSI Part 1 performed?"},null,{"$f":"Q!A5","v":"Was PVP documented?"},null,{"$f":"Q!A6","v":"Was Otoscopy documented?"},null,{"$f":"Q!A7","v":"Document bc at 3 & 4kHz is for programming purposes?"},null,{"$f":"Q!A8","v":"Was Speech testing performed?"},null,{"$f":"Q!A9","v":"Is it documented whether national criteria were/were not met?"},null,{"$f":"Q!A10","v":"Was a BCHI info pack supplied?"},null,{"$f":"Q!A11","v":"Was the report authorised & issued within target (7 days)?"},null,{"$f":"Q!A12","v":"Was consent documented as appropriate?"},null,{"$f":"Q!A13","v":0},null,{"$f":"Q!A14","v":0},null,{"$f":"Q!A15","v":0},null,{"$f":"Q!A16","v":0},null,{"$f":"Q!A17","v":0},null,{"$f":"Q!A18","v":0},null,{"$f":"Q!A19","v":0},null,{"$f":"Q!A20","v":0},null,{"$f":"Q!A21","v":0},null,{"$f":"Q!A22","v":0},null,{"$f":"Q!A23","v":0},null,{"$f":"Q!A24","v":0},null,{"$f":"Q!A25","v":0},null,{"$f":"Q!A26","v":0},null,{"$f":"Q!A27","v":0},null,{"$f":"Q!A28","v":0},null,{"$f":"Q!A29","v":0},null,{"$f":"Q!A30","v":0},null,{"$f":"Q!A31","v":0},null,{"$f":"Q!A32","v":0},null,{"$f":"Q!A33","v":0},null,{"$f":"Q!A34","v":0},null,{"$f":"Q!A35","v":0},null,{"$f":"Q!A36","v":0},null,{"$f":"Q!A37","v":0},null,{"$f":"Q!A38","v":0},null,{"$f":"Q!A39","v":0},null,{"$f":"Q!A40","v":0},null,{"$f":"Q!A41","v":0}]
["Pt number","Date seen","Clinician 1","clinician 2","New/ F-up","Apt code",null,"Compliant?","Other result","Compliant?","Other result","Compliant?","Other result","Compliant?","Other result","Compliant?","Other result","Compliant?","Other result","Compliant?","Other result","Compliant?","Other result","Compliant?","Other result","Compliant?","Other result","Compliant?","Other result","Compliant?","Other result","Compliant?","Other result","Compliant?","Other result","Compliant?","Other result","Compliant?","Other result","Compliant?","Other result","Compliant?","Other result","Compliant?","Other result","Compliant?","Other result","Compliant?","Other result","Compliant?","Other result","Compliant?","Other result","Compliant?","Other result","Compliant?","Other result","Compliant?","Other result","Compliant?","Other result","Compliant?","Other result","Compliant?","Other result","Compliant?","Other result","Compliant?","Other result","Compliant?","Other result","Compliant?","Other result","Compliant?","Other result","Compliant?","Other result","Compliant?","Other result","Compliant?","Other result","Compliant?","Other result","Compliant?","Other result","Compliant?","Other result"]
["AB0001","2023-02-02","AA",null,"New","BA",null,"Yes",null,"No",null,"Yes",null,"Yes",null,"No",null,"Yes",null,"Yes",null,"Yes",null,"Yes",null,"Yes",null,"Yes"]
["AB0002","2023-02-17","AA",null,"New","BA",null,"Yes",null,"Yes",null,"Yes",null,"Yes",null,"Yes",null,"Yes",null,"Yes",null,"Yes",null,"Yes",null,"Yes",null,"Yes"]
["AB0003","2023-02-24","BB",null,"New","BA",null,"No",null,"NA","Room not identified so unable to check","Yes",null,"Yes",null,"Yes",null,"Yes",null,"Yes",null,"Yes",null,"Yes",null,"Yes",null,"Yes"]
["AB0004","2023-02-26","BB",null,"New","BA",null,"Yes",null,"Yes",null,"Yes",null,"Yes",null,"Yes",null,"Yes",null,"Yes",null,"Yes",null,"Yes",null,"Yes",null,"Yes"]
["AB0005","2023-02-28","CC",null,"New","BA",null,"Yes",null,"Yes",null,"Yes",null,"Yes",null,"Yes",null,"Yes",null,"Yes",null,"Yes",null,"Yes",null,"Yes",null,"Yes"]

{"sheet":"feb-Data","index":38,"n_rows":12,"n_cols":41,"rows_kept":12,"cut":false,"hidden":true,"merged":[[0,0,1,0]]}
["Results",{"$f":"Q!A2","v":"Was a Room number documented?"},{"$f":"Q!A3","v":"Were stage A checks completed as appropriate?"},{"$f":"Q!A4","v":"Was COSI Part 1 performed?"},{"$f":"Q!A5","v":"Was PVP documented?"},{"$f":"Q!A6","v":"Was Otoscopy documented?"},{"$f":"Q!A7","v":"Document bc at 3 & 4kHz is for programming purposes?"},{"$f":"Q!A8","v":"Was Speech testing performed?"},{"$f":"Q!A9","v":"Is it documented whether national criteria were/were not met?"},{"$f":"Q!A10","v":"Was a BCHI info pack supplied?"},{"$f":"Q!A11","v":"Was the report authorised & issued within target (7 days)?"},{"$f":"Q!A12","v":"Was consent documented as appropriate?"},{"$f":"Q!A13","v":0},{"$f":"Q!A14","v":0},{"$f":"Q!A15","v":0},{"$f":"Q!A16","v":0},{"$f":"Q!A17","v":0},{"$f":"Q!A18","v":0},{"$f":"Q!A19","v":0},{"$f":"Q!A20","v":0},{"$f":"Q!A21","v":0},{"$f":"Q!A22","v":0},{"$f":"Q!A23","v":0},{"$f":"Q!A24","v":0},{"$f":"Q!A25","v":0},{"$f":"Q!A26","v":0},{"$f":"Q!A27","v":0},{"$f":"Q!A28","v":0},{"$f":"Q!A29","v":0},{"$f":"Q!A30","v":0},{"$f":"Q!A31","v":0},{"$f":"Q!A32","v":0},{"$f":"Q!A33","v":0},{"$f":"Q!A34","v":0},{"$f":"Q!A35","v":0},{"$f":"Q!A36","v":0},{"$f":"Q!A37","v":0},{"$f":"Q!A38","v":0},{"$f":"Q!A39","v":0},{"$f":"Q!A40","v":0},{"$f":"Q!A41","v":0}]
[null,"Compliant?","Compliant?","Compliant?","Compliant?","Compliant?","Compliant?","Compliant?","Compliant?","Compliant?","Compliant?","Compliant?","Compliant?","Compliant?","Compliant?","Compliant?","Compliant?","Compliant?","Compliant?","Compliant?","Compliant?","Compliant?","Compliant?","Compliant?","Compliant?","Compliant?","Compliant?","Compliant?","Compliant?","Compliant?","Compliant?","Compliant?","Compliant?","Compliant?","Compliant?","Compliant?","Compliant?","Compliant?","Compliant?","Compliant?","Compliant?"]
["Total Y",{"$f":"COUNTIF('feb-Raw'!H:H,\"yes\")","v":4},{"$f":"COUNTIF('feb-Raw'!J:J,\"yes\")","v":3},{"$f":"COUNTIF('feb-Raw'!L:L,\"yes\")","v":5},{"$f":"COUNTIF('feb-Raw'!N:N,\"yes\")","v":5},{"$f":"COUNTIF('feb-Raw'!P:P,\"yes\")","v":4},{"$f":"COUNTIF('feb-Raw'!R:R,\"yes\")","v":5},{"$f":"COUNTIF('feb-Raw'!T:T,\"yes\")","v":5},{"$f":"COUNTIF('feb-Raw'!V:V,\"yes\")","v":5},{"$f":"COUNTIF('feb-Raw'!X:X,\"yes\")","v":5},{"$f":"COUNTIF('feb-Raw'!Z:Z,\"yes\")","v":5},{"$f":"COUNTIF('feb-Raw'!AB:AB,\"yes\")","v":5},{"$f":"COUNTIF('feb-Raw'!AD:AD,\"yes\")","v":0},{"$f":"COUNTIF('feb-Raw'!AF:AF,\"yes\")","v":0},{"$f":"COUNTIF('feb-Raw'!AH:AH,\"yes\")","v":0},{"$f":"COUNTIF('feb-Raw'!AJ:AJ,\"yes\")","v":0},{"$f":"COUNTIF('feb-Raw'!AL:AL,\"yes\")","v":0},{"$f":"COUNTIF('feb-Raw'!AN:AN,\"yes\")","v":0},{"$f":"COUNTIF('feb-Raw'!AP:AP,\"yes\")","v":0},{"$f":"COUNTIF('feb-Raw'!AR:AR,\"yes\")","v":0},{"$f":"COUNTIF('feb-Raw'!AT:AT,\"yes\")","v":0},{"$f":"COUNTIF('feb-Raw'!AV:AV,\"yes\")","v":0},{"$f":"COUNTIF('feb-Raw'!AX:AX,\"yes\")","v":0},{"$f":"COUNTIF('feb-Raw'!AZ:AZ,\"yes\")","v":0},{"$f":"COUNTIF('feb-Raw'!BB:BB,\"yes\")","v":0},{"$f":"COUNTIF('feb-Raw'!BD:BD,\"yes\")","v":0},{"$f":"COUNTIF('feb-Raw'!BF:BF,\"yes\")","v":0},{"$f":"COUNTIF('feb-Raw'!BH:BH,\"yes\")","v":0},{"$f":"COUNTIF('feb-Raw'!BJ:BJ,\"yes\")","v":0},{"$f":"COUNTIF('feb-Raw'!BL:BL,\"yes\")","v":0},{"$f":"COUNTIF('feb-Raw'!BN:BN,\"yes\")","v":0},{"$f":"COUNTIF('feb-Raw'!BP:BP,\"yes\")","v":0},{"$f":"COUNTIF('feb-Raw'!BR:BR,\"yes\")","v":0},{"$f":"COUNTIF('feb-Raw'!BT:BT,\"yes\")","v":0},{"$f":"COUNTIF('feb-Raw'!BV:BV,\"yes\")","v":0},{"$f":"COUNTIF('feb-Raw'!BX:BX,\"yes\")","v":0},{"$f":"COUNTIF('feb-Raw'!BZ:BZ,\"yes\")","v":0},{"$f":"COUNTIF('feb-Raw'!CB:CB,\"yes\")","v":0},{"$f":"COUNTIF('feb-Raw'!CD:CD,\"yes\")","v":0},{"$f":"COUNTIF('feb-Raw'!CF:CF,\"yes\")","v":0},{"$f":"COUNTIF('feb-Raw'!CH:CH,\"yes\")","v":0}]
["Total N",{"$f":"COUNTIF('feb-Raw'!H:H,\"no\")","v":1},{"$f":"COUNTIF('feb-Raw'!J:J,\"no\")","v":1},{"$f":"COUNTIF('feb-Raw'!L:L,\"no\")","v":0},{"$f":"COUNTIF('feb-Raw'!N:N,\"no\")","v":0},{"$f":"COUNTIF('feb-Raw'!P:P,\"no\")","v":1},{"$f":"COUNTIF('feb-Raw'!R:R,\"no\")","v":0},{"$f":"COUNTIF('feb-Raw'!T:T,\"no\")","v":0},{"$f":"COUNTIF('feb-Raw'!V:V,\"no\")","v":0},{"$f":"COUNTIF('feb-Raw'!X:X,\"no\")","v":0},{"$f":"COUNTIF('feb-Raw'!Z:Z,\"no\")","v":0},{"$f":"COUNTIF('feb-Raw'!AB:AB,\"no\")","v":0},{"$f":"COUNTIF('feb-Raw'!AD:AD,\"no\")","v":0},{"$f":"COUNTIF('feb-Raw'!AF:AF,\"no\")","v":0},{"$f":"COUNTIF('feb-Raw'!AH:AH,\"no\")","v":0},{"$f":"COUNTIF('feb-Raw'!AJ:AJ,\"no\")","v":0},{"$f":"COUNTIF('feb-Raw'!AL:AL,\"no\")","v":0},{"$f":"COUNTIF('feb-Raw'!AN:AN,\"no\")","v":0},{"$f":"COUNTIF('feb-Raw'!AP:AP,\"no\")","v":0},{"$f":"COUNTIF('feb-Raw'!AR:AR,\"no\")","v":0},{"$f":"COUNTIF('feb-Raw'!AT:AT,\"no\")","v":0},{"$f":"COUNTIF('feb-Raw'!AV:AV,\"no\")","v":0},{"$f":"COUNTIF('feb-Raw'!AX:AX,\"no\")","v":0},{"$f":"COUNTIF('feb-Raw'!AZ:AZ,\"no\")","v":0},{"$f":"COUNTIF('feb-Raw'!BB:BB,\"no\")","v":0},{"$f":"COUNTIF('feb-Raw'!BD:BD,\"no\")","v":0},{"$f":"COUNTIF('feb-Raw'!BF:BF,\"no\")","v":0},{"$f":"COUNTIF('feb-Raw'!BH:BH,\"no\")","v":0},{"$f":"COUNTIF('feb-Raw'!BJ:BJ,\"no\")","v":0},{"$f":"COUNTIF('feb-Raw'!BL:BL,\"no\")","v":0},{"$f":"COUNTIF('feb-Raw'!BN:BN,\"no\")","v":0},{"$f":"COUNTIF('feb-Raw'!BP:BP,\"no\")","v":0},{"$f":"COUNTIF('feb-Raw'!BR:BR,\"no\")","v":0},{"$f":"COUNTIF('feb-Raw'!BT:BT,\"no\")","v":0},{"$f":"COUNTIF('feb-Raw'!BV:BV,\"no\")","v":0},{"$f":"COUNTIF('feb-Raw'!BX:BX,\"no\")","v":0},{"$f":"COUNTIF('feb-Raw'!BZ:BZ,\"no\")","v":0},{"$f":"COUNTIF('feb-Raw'!CB:CB,\"no\")","v":0},{"$f":"COUNTIF('feb-Raw'!CD:CD,\"no\")","v":0},{"$f":"COUNTIF('feb-Raw'!CF:CF,\"no\")","v":0},{"$f":"COUNTIF('feb-Raw'!CH:CH,\"no\")","v":0}]
["Total Justified",{"$f":"COUNTIF('feb-Raw'!H:H,\"Justified\")","v":0},{"$f":"COUNTIF('feb-Raw'!J:J,\"Justified\")","v":0},{"$f":"COUNTIF('feb-Raw'!L:L,\"Justified\")","v":0},{"$f":"COUNTIF('feb-Raw'!N:N,\"Justified\")","v":0},{"$f":"COUNTIF('feb-Raw'!P:P,\"Justified\")","v":0},{"$f":"COUNTIF('feb-Raw'!R:R,\"Justified\")","v":0},{"$f":"COUNTIF('feb-Raw'!T:T,\"Justified\")","v":0},{"$f":"COUNTIF('feb-Raw'!V:V,\"Justified\")","v":0},{"$f":"COUNTIF('feb-Raw'!X:X,\"Justified\")","v":0},{"$f":"COUNTIF('feb-Raw'!Z:Z,\"Justified\")","v":0},{"$f":"COUNTIF('feb-Raw'!AB:AB,\"Justified\")","v":0},{"$f":"COUNTIF('feb-Raw'!AD:AD,\"Justified\")","v":0},{"$f":"COUNTIF('feb-Raw'!AF:AF,\"Justified\")","v":0},{"$f":"COUNTIF('feb-Raw'!AH:AH,\"Justified\")","v":0},{"$f":"COUNTIF('feb-Raw'!AJ:AJ,\"Justified\")","v":0},{"$f":"COUNTIF('feb-Raw'!AL:AL,\"Justified\")","v":0},{"$f":"COUNTIF('feb-Raw'!AN:AN,\"Justified\")","v":0},{"$f":"COUNTIF('feb-Raw'!AP:AP,\"Justified\")","v":0},{"$f":"COUNTIF('feb-Raw'!AR:AR,\"Justified\")","v":0},{"$f":"COUNTIF('feb-Raw'!AT:AT,\"Justified\")","v":0},{"$f":"COUNTIF('feb-Raw'!AV:AV,\"Justified\")","v":0},{"$f":"COUNTIF('feb-Raw'!AX:AX,\"Justified\")","v":0},{"$f":"COUNTIF('feb-Raw'!AZ:AZ,\"Justified\")","v":0},{"$f":"COUNTIF('feb-Raw'!BB:BB,\"Justified\")","v":0},{"$f":"COUNTIF('feb-Raw'!BD:BD,\"Justified\")","v":0},{"$f":"COUNTIF('feb-Raw'!BF:BF,\"Justified\")","v":0},{"$f":"COUNTIF('feb-Raw'!BH:BH,\"Justified\")","v":0},{"$f":"COUNTIF('feb-Raw'!BJ:BJ,\"Justified\")","v":0},{"$f":"COUNTIF('feb-Raw'!BL:BL,\"Justified\")","v":0},{"$f":"COUNTIF('feb-Raw'!BN:BN,\"Justified\")","v":0},{"$f":"COUNTIF('feb-Raw'!BP:BP,\"Justified\")","v":0},{"$f":"COUNTIF('feb-Raw'!BR:BR,\"Justified\")","v":0},{"$f":"COUNTIF('feb-Raw'!BT:BT,\"Justified\")","v":0},{"$f":"COUNTIF('feb-Raw'!BV:BV,\"Justified\")","v":0},{"$f":"COUNTIF('feb-Raw'!BX:BX,\"Justified\")","v":0},{"$f":"COUNTIF('feb-Raw'!BZ:BZ,\"Justified\")","v":0},{"$f":"COUNTIF('feb-Raw'!CB:CB,\"Justified\")","v":0},{"$f":"COUNTIF('feb-Raw'!CD:CD,\"Justified\")","v":0},{"$f":"COUNTIF('feb-Raw'!CF:CF,\"Justified\")","v":0},{"$f":"COUNTIF('feb-Raw'!CH:CH,\"Justified\")","v":0}]
["Total NA",{"$f":"COUNTIF('feb-Raw'!H:H,\"NA\")","v":0},{"$f":"COUNTIF('feb-Raw'!J:J,\"NA\")","v":1},{"$f":"COUNTIF('feb-Raw'!L:L,\"NA\")","v":0},{"$f":"COUNTIF('feb-Raw'!N:N,\"NA\")","v":0},{"$f":"COUNTIF('feb-Raw'!P:P,\"NA\")","v":0},{"$f":"COUNTIF('feb-Raw'!R:R,\"NA\")","v":0},{"$f":"COUNTIF('feb-Raw'!T:T,\"NA\")","v":0},{"$f":"COUNTIF('feb-Raw'!V:V,\"NA\")","v":0},{"$f":"COUNTIF('feb-Raw'!X:X,\"NA\")","v":0},{"$f":"COUNTIF('feb-Raw'!Z:Z,\"NA\")","v":0},{"$f":"COUNTIF('feb-Raw'!AB:AB,\"NA\")","v":0},{"$f":"COUNTIF('feb-Raw'!AD:AD,\"NA\")","v":0},{"$f":"COUNTIF('feb-Raw'!AF:AF,\"NA\")","v":0},{"$f":"COUNTIF('feb-Raw'!AH:AH,\"NA\")","v":0},{"$f":"COUNTIF('feb-Raw'!AJ:AJ,\"NA\")","v":0},{"$f":"COUNTIF('feb-Raw'!AL:AL,\"NA\")","v":0},{"$f":"COUNTIF('feb-Raw'!AN:AN,\"NA\")","v":0},{"$f":"COUNTIF('feb-Raw'!AP:AP,\"NA\")","v":0},{"$f":"COUNTIF('feb-Raw'!AR:AR,\"NA\")","v":0},{"$f":"COUNTIF('feb-Raw'!AT:AT,\"NA\")","v":0},{"$f":"COUNTIF('feb-Raw'!AV:AV,\"NA\")","v":0},{"$f":"COUNTIF('feb-Raw'!AX:AX,\"NA\")","v":0},{"$f":"COUNTIF('feb-Raw'!AZ:AZ,\"NA\")","v":0},{"$f":"COUNTIF('feb-Raw'!BB:BB,\"NA\")","v":0},{"$f":"COUNTIF('feb-Raw'!BD:BD,\"NA\")","v":0},{"$f":"COUNTIF('feb-Raw'!BF:BF,\"NA\")","v":0},{"$f":"COUNTIF('feb-Raw'!BH:BH,\"NA\")","v":0},{"$f":"COUNTIF('feb-Raw'!BJ:BJ,\"NA\")","v":0},{"$f":"COUNTIF('feb-Raw'!BL:BL,\"NA\")","v":0},{"$f":"COUNTIF('feb-Raw'!BN:BN,\"NA\")","v":0},{"$f":"COUNTIF('feb-Raw'!BP:BP,\"NA\")","v":0},{"$f":"COUNTIF('feb-Raw'!BR:BR,\"NA\")","v":0},{"$f":"COUNTIF('feb-Raw'!BT:BT,\"NA\")","v":0},{"$f":"COUNTIF('feb-Raw'!BV:BV,\"NA\")","v":0},{"$f":"COUNTIF('feb-Raw'!BX:BX,\"NA\")","v":0},{"$f":"COUNTIF('feb-Raw'!BZ:BZ,\"NA\")","v":0},{"$f":"COUNTIF('feb-Raw'!CB:CB,\"NA\")","v":0},{"$f":"COUNTIF('feb-Raw'!CD:CD,\"NA\")","v":0},{"$f":"COUNTIF('feb-Raw'!CF:CF,\"NA\")","v":0},{"$f":"COUNTIF('feb-Raw'!CH:CH,\"NA\")","v":0}]
["Blanks",{"$f":"B8-(SUM(B3:B6))","v":0},{"$f":"C8-(SUM(C3:C6))","v":0},0,0,0,0,0,0,0,0,0,5,5,5,5,5,5,5,5,5,5,5,5,5,5,5,5,5,5,5,5,5,5,5,5,5,5,5,5,5]
["full sample size",{"$f":"COUNTA('feb-Raw'!A:A)-2","v":5},{"$f":"B8","v":5},5,5,5,5,5,5,5,5,5,5,5,5,5,5,5,5,5,5,5,5,5,5,5,5,5,5,5,5,5,5,5,5,5,5,5,5,5,5]
["True sample size (-NA + blanks)",{"$f":"IF(ISERROR(B8-(B6+B7)),\"\",B8-(B6+B7))","v":5},{"$f":"IF(ISERROR(C8-(C6+C7)),\"\",C8-(C6+C7))","v":4},5,5,5,5,5,5,5,5,5,0,0,0,0,0,0,0,0,0,0,0,0,0,0,0,0,0,0,0,0,0,0,0,0,0,0,0,0,0]
["%Y",{"$f":"IF(ISERROR(B3/B9),\"\",B3/B9)","v":0.8},{"$f":"IF(ISERROR(C3/C9),\"\",C3/C9)","v":0.75},1,1,0.8,1,1,1,1,1,1,"","","","","","","","","","","","","","","","","","","","","","","","","","","","",""]
["%N",{"$f":"IF(ISERROR(B4/B9),\"\",B4/B9)","v":0.2},{"$f":"IF(ISERROR(C4/C9),\"\",C4/C9)","v":0.25},0,0,0.2,0,0,0,0,0,0,"","","","","","","","","","","","","","","","","","","","","","","","","","","","",""]
["%N - Justified",{"$f":"IF(ISERROR(B5/B9),\"\",B5/B9)","v":0},{"$f":"IF(ISERROR(C5/C9),\"\",C5/C9)","v":0},0,0,0,0,0,0,0,0,0,"","","","","","","","","","","","","","","","","","","","","","","","","","","","",""]

{"sheet":"March","index":39,"n_rows":51,"n_cols":8,"rows_kept":51,"cut":false,"hidden":false,"merged":[]}
["Click here to go to year overview"]
[]
["Date",null,null,"Total by Apt type"]
["Completed by",null,null,"New",{"$f":"COUNTIF('march-Raw'!E3:E103,\"New\")","v":3}]
["Sample group size",{"$f":"COUNTA('march-Raw'!A:A)-2","v":3},null,"Follow up",{"$f":"COUNTIF('march-Raw'!E3:E103,\"Fup\")","v":0},null,null,{"$f":"Year!H5","v":0.95}]
["Overall Result (compliant only)",{"$f":"IF(ISERROR(SUM(D11:D50)/G51),\"\",SUM(D11:D50)/G51)","v":0.8787878787878789},null,"Total by apt Code",null,null,null,{"$f":"Year!H6","v":"80-95%"}]
["Overall Result (compliant & Justified)",{"$f":"IF(ISERROR(SUM(C11:C50)/G51),\"\",SUM(C11:C50)/G51)","v":0.96969696969696961},null,"code goes in here",{"$f":"COUNTIF('march-Raw'!F3:F103,D7)","v":0},null,null,{"$f":"Year!H7","v":0.8}]
["viable qs",{"$f":"G51","v":11}]
[]
["Metric","Target %","Compliant + Justified","Compliant","Justified","Not compliant","Irritating math"]
[{"$f":"IF(ISERROR(Q!A2),\"\",Q!A2)","v":"Was a Room number documented?"},{"$f":"IF(ISERROR(Q!B2),\"\",Q!B2)","v":0},{"$f":"IF(ISERROR(D11+E11),\"\",D11+E11)","v":1},{"$f":"'march-Data'!B10","v":1},{"$f":"'march-Data'!B12","v":0},{"$f":"'march-Data'!B11","v":0},{"$f":"COUNTIF(D11:F11,\">0\")","v":1}]
[{"$f":"IF(ISERROR(Q!A3),\"\",Q!A3)","v":"Were stage A checks completed as appropriate?"},{"$f":"IF(ISERROR(Q!B3),\"\",Q!B3)","v":0},1,{"$f":"'march-Data'!C10","v":1},{"$f":"'march-Data'!C12","v":0},{"$f":"'march-Data'!C11","v":0},1]
[{"$f":"IF(ISERROR(Q!A4),\"\",Q!A4)","v":"Was COSI Part 1 performed?"},{"$f":"IF(ISERROR(Q!B4),\"\",Q!B4)","v":0},0.66666666666666663,{"$f":"'march-Data'!D10","v":0.66666666666666663},{"$f":"'march-Data'!D12","v":0},{"$f":"'march-Data'!D11","v":0.33333333333333331},2]
[{"$f":"IF(ISERROR(Q!A5),\"\",Q!A5)","v":"Was PVP documented?"},{"$f":"IF(ISERROR(Q!B5),\"\",Q!B5)","v":0},1,{"$f":"'march-Data'!E10","v":1},{"$f":"'march-Data'!E12","v":0},{"$f":"'march-Data'!E11","v":0},1]
[{"$f":"IF(ISERROR(Q!A6),\"\",Q!A6)","v":"Was Otoscopy documented?"},{"$f":"IF(ISERROR(Q!B6),\"\",Q!B6)","v":0},1,{"$f":"'march-Data'!F10","v":1},{"$f":"'march-Data'!F12","v":0},{"$f":"'march-Data'!F11","v":0},1]
[{"$f":"IF(ISERROR(Q!A7),\"\",Q!A7)","v":"Document bc at 3 & 4kHz is for programming purposes?"},{"$f":"IF(ISERROR(Q!B7),\"\",Q!B7)","v":0},1,{"$f":"'march-Data'!G10","v":0.66666666666666663},{"$f":"'march-Data'!G12","v":0.33333333333333331},{"$f":"'march-Data'!G11","v":0},2]
[{"$f":"IF(ISERROR(Q!A8),\"\",Q!A8)","v":"Was Speech testing performed?"},{"$f":"IF(ISERROR(Q!B8),\"\",Q!B8)","v":0},1,{"$f":"'march-Data'!H10","v":0.66666666666666663},{"$f":"'march-Data'!H12","v":0.33333333333333331},{"$f":"'march-Data'!H11","v":0},2]
[{"$f":"IF(ISERROR(Q!A9),\"\",Q!A9)","v":"Is it documented whether national criteria were/were not met?"},{"$f":"IF(ISERROR(Q!B9),\"\",Q!B9)","v":0},1,{"$f":"'march-Data'!I10","v":1},{"$f":"'march-Data'!I12","v":0},{"$f":"'march-Data'!I11","v":0},1]
[{"$f":"IF(ISERROR(Q!A10),\"\",Q!A10)","v":"Was a BCHI info pack supplied?"},{"$f":"IF(ISERROR(Q!B10),\"\",Q!B10)","v":0},1,{"$f":"'march-Data'!J10","v":0.66666666666666663},{"$f":"'march-Data'!J12","v":0.33333333333333331},{"$f":"'march-Data'!J11","v":0},2]
[{"$f":"IF(ISERROR(Q!A11),\"\",Q!A11)","v":"Was the report authorised & issued within target (7 days)?"},{"$f":"IF(ISERROR(Q!B11),\"\",Q!B11)","v":0},1,{"$f":"'march-Data'!K10","v":1},{"$f":"'march-Data'!K12","v":0},{"$f":"'march-Data'!K11","v":0},1]
[{"$f":"IF(ISERROR(Q!A12),\"\",Q!A12)","v":"Was consent documented as appropriate?"},{"$f":"IF(ISERROR(Q!B12),\"\",Q!B12)","v":0},1,{"$f":"'march-Data'!L10","v":1},{"$f":"'march-Data'!L12","v":0},{"$f":"'march-Data'!L11","v":0},1]
[{"$f":"IF(ISERROR(Q!A13),\"\",Q!A13)","v":0},{"$f":"IF(ISERROR(Q!B13),\"\",Q!B13)","v":0},"",{"$f":"'march-Data'!M10","v":""},{"$f":"'march-Data'!M12","v":""},{"$f":"'march-Data'!M11","v":""},0]
[{"$f":"IF(ISERROR(Q!A14),\"\",Q!A14)","v":0},{"$f":"IF(ISERROR(Q!B14),\"\",Q!B14)","v":0},"",{"$f":"'march-Data'!N10","v":""},{"$f":"'march-Data'!N12","v":""},{"$f":"'march-Data'!N11","v":""},0]
[{"$f":"IF(ISERROR(Q!A15),\"\",Q!A15)","v":0},{"$f":"IF(ISERROR(Q!B15),\"\",Q!B15)","v":0},"",{"$f":"'march-Data'!O10","v":""},{"$f":"'march-Data'!O12","v":""},{"$f":"'march-Data'!O11","v":""},0]
[{"$f":"IF(ISERROR(Q!A16),\"\",Q!A16)","v":0},{"$f":"IF(ISERROR(Q!B16),\"\",Q!B16)","v":0},"",{"$f":"'march-Data'!P10","v":""},{"$f":"'march-Data'!P12","v":""},{"$f":"'march-Data'!P11","v":""},0]
[{"$f":"IF(ISERROR(Q!A17),\"\",Q!A17)","v":0},{"$f":"IF(ISERROR(Q!B17),\"\",Q!B17)","v":0},"",{"$f":"'march-Data'!Q10","v":""},{"$f":"'march-Data'!Q12","v":""},{"$f":"'march-Data'!Q11","v":""},0]
[{"$f":"IF(ISERROR(Q!A18),\"\",Q!A18)","v":0},{"$f":"IF(ISERROR(Q!B18),\"\",Q!B18)","v":0},"",{"$f":"'march-Data'!R10","v":""},{"$f":"'march-Data'!R12","v":""},{"$f":"'march-Data'!R11","v":""},0]
[{"$f":"IF(ISERROR(Q!A19),\"\",Q!A19)","v":0},{"$f":"IF(ISERROR(Q!B19),\"\",Q!B19)","v":0},"",{"$f":"'march-Data'!S10","v":""},{"$f":"'march-Data'!S12","v":""},{"$f":"'march-Data'!S11","v":""},0]
[{"$f":"IF(ISERROR(Q!A20),\"\",Q!A20)","v":0},{"$f":"IF(ISERROR(Q!B20),\"\",Q!B20)","v":0},"",{"$f":"'march-Data'!T10","v":""},{"$f":"'march-Data'!T12","v":""},{"$f":"'march-Data'!T11","v":""},0]
[{"$f":"IF(ISERROR(Q!A21),\"\",Q!A21)","v":0},{"$f":"IF(ISERROR(Q!B21),\"\",Q!B21)","v":0},"",{"$f":"'march-Data'!U10","v":""},{"$f":"'march-Data'!U12","v":""},{"$f":"'march-Data'!U11","v":""},0]
[{"$f":"IF(ISERROR(Q!A22),\"\",Q!A22)","v":0},{"$f":"IF(ISERROR(Q!B22),\"\",Q!B22)","v":0},"",{"$f":"'march-Data'!V10","v":""},{"$f":"'march-Data'!V12","v":""},{"$f":"'march-Data'!V11","v":""},0]
[{"$f":"IF(ISERROR(Q!A23),\"\",Q!A23)","v":0},{"$f":"IF(ISERROR(Q!B23),\"\",Q!B23)","v":0},"",{"$f":"'march-Data'!W10","v":""},{"$f":"'march-Data'!W12","v":""},{"$f":"'march-Data'!W11","v":""},0]
[{"$f":"IF(ISERROR(Q!A24),\"\",Q!A24)","v":0},{"$f":"IF(ISERROR(Q!B24),\"\",Q!B24)","v":0},"",{"$f":"'march-Data'!X10","v":""},{"$f":"'march-Data'!X12","v":""},{"$f":"'march-Data'!X11","v":""},0]
[{"$f":"IF(ISERROR(Q!A25),\"\",Q!A25)","v":0},{"$f":"IF(ISERROR(Q!B25),\"\",Q!B25)","v":0},"",{"$f":"'march-Data'!Y10","v":""},{"$f":"'march-Data'!Y12","v":""},{"$f":"'march-Data'!Y11","v":""},0]
[{"$f":"IF(ISERROR(Q!A26),\"\",Q!A26)","v":0},{"$f":"IF(ISERROR(Q!B26),\"\",Q!B26)","v":0},"",{"$f":"'march-Data'!Z10","v":""},{"$f":"'march-Data'!Z12","v":""},{"$f":"'march-Data'!Z11","v":""},0]
[{"$f":"IF(ISERROR(Q!A27),\"\",Q!A27)","v":0},{"$f":"IF(ISERROR(Q!B27),\"\",Q!B27)","v":0},"",{"$f":"'march-Data'!AA10","v":""},{"$f":"'march-Data'!AA12","v":""},{"$f":"'march-Data'!AA11","v":""},0]
[{"$f":"IF(ISERROR(Q!A28),\"\",Q!A28)","v":0},{"$f":"IF(ISERROR(Q!B28),\"\",Q!B28)","v":0},"",{"$f":"'march-Data'!AB10","v":""},{"$f":"'march-Data'!AB12","v":""},{"$f":"'march-Data'!AB11","v":""},0]
[{"$f":"IF(ISERROR(Q!A29),\"\",Q!A29)","v":0},{"$f":"IF(ISERROR(Q!B29),\"\",Q!B29)","v":0},"",{"$f":"'march-Data'!AC10","v":""},{"$f":"'march-Data'!AC12","v":""},{"$f":"'march-Data'!AC11","v":""},0]
[{"$f":"IF(ISERROR(Q!A30),\"\",Q!A30)","v":0},{"$f":"IF(ISERROR(Q!B30),\"\",Q!B30)","v":0},"",{"$f":"'march-Data'!AD10","v":""},{"$f":"'march-Data'!AD12","v":""},{"$f":"'march-Data'!AD11","v":""},0]
[{"$f":"IF(ISERROR(Q!A31),\"\",Q!A31)","v":0},{"$f":"IF(ISERROR(Q!B31),\"\",Q!B31)","v":0},"",{"$f":"'march-Data'!AE10","v":""},{"$f":"'march-Data'!AE12","v":""},{"$f":"'march-Data'!AE11","v":""},0]
[{"$f":"IF(ISERROR(Q!A32),\"\",Q!A32)","v":0},{"$f":"IF(ISERROR(Q!B32),\"\",Q!B32)","v":0},"",{"$f":"'march-Data'!AF10","v":""},{"$f":"'march-Data'!AF12","v":""},{"$f":"'march-Data'!AF11","v":""},0]
[{"$f":"IF(ISERROR(Q!A33),\"\",Q!A33)","v":0},{"$f":"IF(ISERROR(Q!B33),\"\",Q!B33)","v":0},"",{"$f":"'march-Data'!AG10","v":""},{"$f":"'march-Data'!AG12","v":""},{"$f":"'march-Data'!AG11","v":""},0]
[{"$f":"IF(ISERROR(Q!A34),\"\",Q!A34)","v":0},{"$f":"IF(ISERROR(Q!B34),\"\",Q!B34)","v":0},"",{"$f":"'march-Data'!AH10","v":""},{"$f":"'march-Data'!AH12","v":""},{"$f":"'march-Data'!AH11","v":""},0]
[{"$f":"IF(ISERROR(Q!A35),\"\",Q!A35)","v":0},{"$f":"IF(ISERROR(Q!B35),\"\",Q!B35)","v":0},"",{"$f":"'march-Data'!AI10","v":""},{"$f":"'march-Data'!AI12","v":""},{"$f":"'march-Data'!AI11","v":""},0]
[{"$f":"IF(ISERROR(Q!A36),\"\",Q!A36)","v":0},{"$f":"IF(ISERROR(Q!B36),\"\",Q!B36)","v":0},"",{"$f":"'march-Data'!AJ10","v":""},{"$f":"'march-Data'!AJ12","v":""},{"$f":"'march-Data'!AJ11","v":""},0]
[{"$f":"IF(ISERROR(Q!A37),\"\",Q!A37)","v":0},{"$f":"IF(ISERROR(Q!B37),\"\",Q!B37)","v":0},"",{"$f":"'march-Data'!AK10","v":""},{"$f":"'march-Data'!AK12","v":""},{"$f":"'march-Data'!AK11","v":""},0]
[{"$f":"IF(ISERROR(Q!A38),\"\",Q!A38)","v":0},{"$f":"IF(ISERROR(Q!B38),\"\",Q!B38)","v":0},"",{"$f":"'march-Data'!AL10","v":""},{"$f":"'march-Data'!AL12","v":""},{"$f":"'march-Data'!AL11","v":""},0]
[{"$f":"IF(ISERROR(Q!A39),\"\",Q!A39)","v":0},{"$f":"IF(ISERROR(Q!B39),\"\",Q!B39)","v":0},"",{"$f":"'march-Data'!AM10","v":""},{"$f":"'march-Data'!AM12","v":""},{"$f":"'march-Data'!AM11","v":""},0]
[{"$f":"IF(ISERROR(Q!A40),\"\",Q!A40)","v":0},{"$f":"IF(ISERROR(Q!B40),\"\",Q!B40)","v":0},"",{"$f":"'march-Data'!AN10","v":""},{"$f":"'march-Data'!AN12","v":""},{"$f":"'march-Data'!AN11","v":""},0]
[{"$f":"IF(ISERROR(Q!A41),\"\",Q!A41)","v":0},{"$f":"IF(ISERROR(Q!B41),\"\",Q!B41)","v":0},"",{"$f":"'march-Data'!AO10","v":""},{"$f":"'march-Data'!AO12","v":""},{"$f":"'march-Data'!AO11","v":""},0]
[null,null,null,null,null,null,{"$f":"COUNTIF(G11:G50,\">=1\")","v":11}]

{"sheet":"march-Raw","index":40,"n_rows":5,"n_cols":87,"rows_kept":5,"cut":false,"hidden":true,"merged":[[0,85,0,86],[0,63,0,64],[0,65,0,66],[0,67,0,68],[0,69,0,70],[0,71,0,72],[0,73,0,74],[0,75,0,76],[0,77,0,78],[0,79,0,80],[0,81,0,82],[0,83,0,84],[0,61,0,62],[0,39,0,40],[0,41,0,42],[0,43,0,44],[0,45,0,46],[0,47,0,48],[0,49,0,50],[0,51,0,52],[0,53,0,54],[0,55,0,56],[0,57,0,58],[0,59,0,60],[0,37,0,38],[0,15,0,16],[0,17,0,18],[0,19,0,20],[0,21,0,22],[0,23,0,24],[0,25,0,26],[0,27,0,28],[0,29,0,30],[0,31,0,32],[0,33,0,34],[0,35,0,36],[0,13,0,14],[0,0,0,5],[0,6,1,6],[0,7,0,8],[0,9,0,10],[0,11,0,12]]}
["Record details",null,null,null,null,null,"Notes",{"$f":"Q!A2","v":"Was a Room number documented?"},null,{"$f":"Q!A3","v":"Were stage A checks completed as appropriate?"},null,{"$f":"Q!A4","v":"Was COSI Part 1 performed?"},null,{"$f":"Q!A5","v":"Was PVP documented?"},null,{"$f":"Q!A6","v":"Was Otoscopy documented?"},null,{"$f":"Q!A7","v":"Document bc at 3 & 4kHz is for programming purposes?"},null,{"$f":"Q!A8","v":"Was Speech testing performed?"},null,{"$f":"Q!A9","v":"Is it documented whether national criteria were/were not met?"},null,{"$f":"Q!A10","v":"Was a BCHI info pack supplied?"},null,{"$f":"Q!A11","v":"Was the report authorised & issued within target (7 days)?"},null,{"$f":"Q!A12","v":"Was consent documented as appropriate?"},null,{"$f":"Q!A13","v":0},null,{"$f":"Q!A14","v":0},null,{"$f":"Q!A15","v":0},null,{"$f":"Q!A16","v":0},null,{"$f":"Q!A17","v":0},null,{"$f":"Q!A18","v":0},null,{"$f":"Q!A19","v":0},null,{"$f":"Q!A20","v":0},null,{"$f":"Q!A21","v":0},null,{"$f":"Q!A22","v":0},null,{"$f":"Q!A23","v":0},null,{"$f":"Q!A24","v":0},null,{"$f":"Q!A25","v":0},null,{"$f":"Q!A26","v":0},null,{"$f":"Q!A27","v":0},null,{"$f":"Q!A28","v":0},null,{"$f":"Q!A29","v":0},null,{"$f":"Q!A30","v":0},null,{"$f":"Q!A31","v":0},null,{"$f":"Q!A32","v":0},null,{"$f":"Q!A33","v":0},null,{"$f":"Q!A34","v":0},null,{"$f":"Q!A35","v":0},null,{"$f":"Q!A36","v":0},null,{"$f":"Q!A37","v":0},null,{"$f":"Q!A38","v":0},null,{"$f":"Q!A39","v":0},null,{"$f":"Q!A40","v":0},null,{"$f":"Q!A41","v":0}]
["Pt number","Date seen","Clinician 1","clinician 2","New/ F-up","Apt code",null,"Compliant?","Other result","Compliant?","Other result","Compliant?","Other result","Compliant?","Other result","Compliant?","Other result","Compliant?","Other result","Compliant?","Other result","Compliant?","Other result","Compliant?","Other result","Compliant?","Other result","Compliant?","Other result","Compliant?","Other result","Compliant?","Other result","Compliant?","Other result","Compliant?","Other result","Compliant?","Other result","Compliant?","Other result","Compliant?","Other result","Compliant?","Other result","Compliant?","Other result","Compliant?","Other result","Compliant?","Other result","Compliant?","Other result","Compliant?","Other result","Compliant?","Other result","Compliant?","Other result","Compliant?","Other result","Compliant?","Other result","Compliant?","Other result","Compliant?","Other result","Compliant?","Other result","Compliant?","Other result","Compliant?","Other result","Compliant?","Other result","Compliant?","Other result","Compliant?","Other result","Compliant?","Other result","Compliant?","Other result","Compliant?","Other result","Compliant?","Other result"]
["AB0001","2023-03-03","AA",null,"New","BA",null,"Yes",null,"Yes",null,"Yes",null,"Yes",null,"Yes",null,"Justified","PTA not performed","Justified","Insufficient air-bone gap on PTA supplied to be BCHI candidate","Yes",null,"Justified","To have further BCHI assessment after post op visit to ENT","Yes",null,"Yes"]
["AB0002","2023-03-17","AA",null,"New","BA",null,"Yes",null,"Yes",null,"No",null,"Yes",null,"Yes",null,"Yes",null,"Yes",null,"Yes",null,"Yes",null,"Yes",null,"Yes"]
["AB0003","2023-03-24","BB",null,"New","BA",null,"Yes",null,"Yes",null,"Yes",null,"Yes",null,"Yes",null,"Yes",null,"Yes",null,"Yes",null,"Yes",null,"Yes",null,"Yes"]

{"sheet":"Export","index":41,"n_rows":58,"n_cols":8,"rows_kept":58,"cut":false,"hidden":false,"merged":[[5,1,5,2],[5,3,5,4],[3,2,3,4],[1,1,1,5],[57,2,57,5],[55,2,55,5],[54,2,54,5],[52,1,52,5],[51,1,51,5]]}
[]
[null,"BCHI - Assessments"]
[]
[null,"Month:","May",null,null,null,null,"ignore me"]
[null,null,null,null,null,null,null,0.95]
[null,"Sample Size:",null,4,null,null,null,"80-95%"]
[null,null,null,null,null,null,null,0.8]
[]
[]
[null,"Metric","Target","Result","Prev result","Notes"]
[null,"Was a Room number documented?",null,1,1]
[null,"Were stage A checks completed as appropriate?",null,0.75,1]
[null,"Was COSI Part 1 performed?",null,0.5,0.6]
[null,"Was PVP documented?",null,1,1]
[null,"Was Otoscopy documented?",null,1,1]
[null,"Document bc at 3 & 4kHz is for programming purposes?",null,1,1]
[null,"Was Speech testing performed?",null,1,1]
[null,"Is it documented whether national criteria were/were not met?",null,1,0.8]
[null,"Was a BCHI info pack supplied?",null,1,1]
[null,"Was the report authorised & issued within target (7 days)?",null,1,1]
[null,"Was consent documented as appropriate?",null,1,1]
[]
[]
[]
[]
[]
[]
[]
[]
[]
[]
[]
[]
[]
[]
[]
[]
[]
[]
[]
[]
[]
[]
[]
[]
[]
[]
[]
[]
[]
[]
[null,"Action plan"]
[]
[]
[null,"Completed by:"]
[null,"Sponsor:"]
[]
[null,"QMA next due:"]

{"sheet":"march-Data","index":42,"n_rows":12,"n_cols":41,"rows_kept":12,"cut":false,"hidden":true,"merged":[[0,0,1,0]]}
["Results",{"$f":"Q!A2","v":"Was a Room number documented?"},{"$f":"Q!A3","v":"Were stage A checks completed as appropriate?"},{"$f":"Q!A4","v":"Was COSI Part 1 performed?"},{"$f":"Q!A5","v":"Was PVP documented?"},{"$f":"Q!A6","v":"Was Otoscopy documented?"},{"$f":"Q!A7","v":"Document bc at 3 & 4kHz is for programming purposes?"},{"$f":"Q!A8","v":"Was Speech testing performed?"},{"$f":"Q!A9","v":"Is it documented whether national criteria were/were not met?"},{"$f":"Q!A10","v":"Was a BCHI info pack supplied?"},{"$f":"Q!A11","v":"Was the report authorised & issued within target (7 days)?"},{"$f":"Q!A12","v":"Was consent documented as appropriate?"},{"$f":"Q!A13","v":0},{"$f":"Q!A14","v":0},{"$f":"Q!A15","v":0},{"$f":"Q!A16","v":0},{"$f":"Q!A17","v":0},{"$f":"Q!A18","v":0},{"$f":"Q!A19","v":0},{"$f":"Q!A20","v":0},{"$f":"Q!A21","v":0},{"$f":"Q!A22","v":0},{"$f":"Q!A23","v":0},{"$f":"Q!A24","v":0},{"$f":"Q!A25","v":0},{"$f":"Q!A26","v":0},{"$f":"Q!A27","v":0},{"$f":"Q!A28","v":0},{"$f":"Q!A29","v":0},{"$f":"Q!A30","v":0},{"$f":"Q!A31","v":0},{"$f":"Q!A32","v":0},{"$f":"Q!A33","v":0},{"$f":"Q!A34","v":0},{"$f":"Q!A35","v":0},{"$f":"Q!A36","v":0},{"$f":"Q!A37","v":0},{"$f":"Q!A38","v":0},{"$f":"Q!A39","v":0},{"$f":"Q!A40","v":0},{"$f":"Q!A41","v":0}]
[null,"Compliant?","Compliant?","Compliant?","Compliant?","Compliant?","Compliant?","Compliant?","Compliant?","Compliant?","Compliant?","Compliant?","Compliant?","Compliant?","Compliant?","Compliant?","Compliant?","Compliant?","Compliant?","Compliant?","Compliant?","Compliant?","Compliant?","Compliant?","Compliant?","Compliant?","Compliant?","Compliant?","Compliant?","Compliant?","Compliant?","Compliant?","Compliant?","Compliant?","Compliant?","Compliant?","Compliant?","Compliant?","Compliant?","Compliant?","Compliant?"]
["Total Y",{"$f":"COUNTIF('march-Raw'!H:H,\"yes\")","v":3},{"$f":"COUNTIF('march-Raw'!J:J,\"yes\")","v":3},{"$f":"COUNTIF('march-Raw'!L:L,\"yes\")","v":2},{"$f":"COUNTIF('march-Raw'!N:N,\"yes\")","v":3},{"$f":"COUNTIF('march-Raw'!P:P,\"yes\")","v":3},{"$f":"COUNTIF('march-Raw'!R:R,\"yes\")","v":2},{"$f":"COUNTIF('march-Raw'!T:T,\"yes\")","v":2},{"$f":"COUNTIF('march-Raw'!V:V,\"yes\")","v":3},{"$f":"COUNTIF('march-Raw'!X:X,\"yes\")","v":2},{"$f":"COUNTIF('march-Raw'!Z:Z,\"yes\")","v":3},{"$f":"COUNTIF('march-Raw'!AB:AB,\"yes\")","v":3},{"$f":"COUNTIF('march-Raw'!AD:AD,\"yes\")","v":0},{"$f":"COUNTIF('march-Raw'!AF:AF,\"yes\")","v":0},{"$f":"COUNTIF('march-Raw'!AH:AH,\"yes\")","v":0},{"$f":"COUNTIF('march-Raw'!AJ:AJ,\"yes\")","v":0},{"$f":"COUNTIF('march-Raw'!AL:AL,\"yes\")","v":0},{"$f":"COUNTIF('march-Raw'!AN:AN,\"yes\")","v":0},{"$f":"COUNTIF('march-Raw'!AP:AP,\"yes\")","v":0},{"$f":"COUNTIF('march-Raw'!AR:AR,\"yes\")","v":0},{"$f":"COUNTIF('march-Raw'!AT:AT,\"yes\")","v":0},{"$f":"COUNTIF('march-Raw'!AV:AV,\"yes\")","v":0},{"$f":"COUNTIF('march-Raw'!AX:AX,\"yes\")","v":0},{"$f":"COUNTIF('march-Raw'!AZ:AZ,\"yes\")","v":0},{"$f":"COUNTIF('march-Raw'!BB:BB,\"yes\")","v":0},{"$f":"COUNTIF('march-Raw'!BD:BD,\"yes\")","v":0},{"$f":"COUNTIF('march-Raw'!BF:BF,\"yes\")","v":0},{"$f":"COUNTIF('march-Raw'!BH:BH,\"yes\")","v":0},{"$f":"COUNTIF('march-Raw'!BJ:BJ,\"yes\")","v":0},{"$f":"COUNTIF('march-Raw'!BL:BL,\"yes\")","v":0},{"$f":"COUNTIF('march-Raw'!BN:BN,\"yes\")","v":0},{"$f":"COUNTIF('march-Raw'!BP:BP,\"yes\")","v":0},{"$f":"COUNTIF('march-Raw'!BR:BR,\"yes\")","v":0},{"$f":"COUNTIF('march-Raw'!BT:BT,\"yes\")","v":0},{"$f":"COUNTIF('march-Raw'!BV:BV,\"yes\")","v":0},{"$f":"COUNTIF('march-Raw'!BX:BX,\"yes\")","v":0},{"$f":"COUNTIF('march-Raw'!BZ:BZ,\"yes\")","v":0},{"$f":"COUNTIF('march-Raw'!CB:CB,\"yes\")","v":0},{"$f":"COUNTIF('march-Raw'!CD:CD,\"yes\")","v":0},{"$f":"COUNTIF('march-Raw'!CF:CF,\"yes\")","v":0},{"$f":"COUNTIF('march-Raw'!CH:CH,\"yes\")","v":0}]
["Total N",{"$f":"COUNTIF('march-Raw'!H:H,\"no\")","v":0},{"$f":"COUNTIF('march-Raw'!J:J,\"no\")","v":0},{"$f":"COUNTIF('march-Raw'!L:L,\"no\")","v":1},{"$f":"COUNTIF('march-Raw'!N:N,\"no\")","v":0},{"$f":"COUNTIF('march-Raw'!P:P,\"no\")","v":0},{"$f":"COUNTIF('march-Raw'!R:R,\"no\")","v":0},{"$f":"COUNTIF('march-Raw'!T:T,\"no\")","v":0},{"$f":"COUNTIF('march-Raw'!V:V,\"no\")","v":0},{"$f":"COUNTIF('march-Raw'!X:X,\"no\")","v":0},{"$f":"COUNTIF('march-Raw'!Z:Z,\"no\")","v":0},{"$f":"COUNTIF('march-Raw'!AB:AB,\"no\")","v":0},{"$f":"COUNTIF('march-Raw'!AD:AD,\"no\")","v":0},{"$f":"COUNTIF('march-Raw'!AF:AF,\"no\")","v":0},{"$f":"COUNTIF('march-Raw'!AH:AH,\"no\")","v":0},{"$f":"COUNTIF('march-Raw'!AJ:AJ,\"no\")","v":0},{"$f":"COUNTIF('march-Raw'!AL:AL,\"no\")","v":0},{"$f":"COUNTIF('march-Raw'!AN:AN,\"no\")","v":0},{"$f":"COUNTIF('march-Raw'!AP:AP,\"no\")","v":0},{"$f":"COUNTIF('march-Raw'!AR:AR,\"no\")","v":0},{"$f":"COUNTIF('march-Raw'!AT:AT,\"no\")","v":0},{"$f":"COUNTIF('march-Raw'!AV:AV,\"no\")","v":0},{"$f":"COUNTIF('march-Raw'!AX:AX,\"no\")","v":0},{"$f":"COUNTIF('march-Raw'!AZ:AZ,\"no\")","v":0},{"$f":"COUNTIF('march-Raw'!BB:BB,\"no\")","v":0},{"$f":"COUNTIF('march-Raw'!BD:BD,\"no\")","v":0},{"$f":"COUNTIF('march-Raw'!BF:BF,\"no\")","v":0},{"$f":"COUNTIF('march-Raw'!BH:BH,\"no\")","v":0},{"$f":"COUNTIF('march-Raw'!BJ:BJ,\"no\")","v":0},{"$f":"COUNTIF('march-Raw'!BL:BL,\"no\")","v":0},{"$f":"COUNTIF('march-Raw'!BN:BN,\"no\")","v":0},{"$f":"COUNTIF('march-Raw'!BP:BP,\"no\")","v":0},{"$f":"COUNTIF('march-Raw'!BR:BR,\"no\")","v":0},{"$f":"COUNTIF('march-Raw'!BT:BT,\"no\")","v":0},{"$f":"COUNTIF('march-Raw'!BV:BV,\"no\")","v":0},{"$f":"COUNTIF('march-Raw'!BX:BX,\"no\")","v":0},{"$f":"COUNTIF('march-Raw'!BZ:BZ,\"no\")","v":0},{"$f":"COUNTIF('march-Raw'!CB:CB,\"no\")","v":0},{"$f":"COUNTIF('march-Raw'!CD:CD,\"no\")","v":0},{"$f":"COUNTIF('march-Raw'!CF:CF,\"no\")","v":0},{"$f":"COUNTIF('march-Raw'!CH:CH,\"no\")","v":0}]
["Total Justified",{"$f":"COUNTIF('march-Raw'!H:H,\"Justified\")","v":0},{"$f":"COUNTIF('march-Raw'!J:J,\"Justified\")","v":0},{"$f":"COUNTIF('march-Raw'!L:L,\"Justified\")","v":0},{"$f":"COUNTIF('march-Raw'!N:N,\"Justified\")","v":0},{"$f":"COUNTIF('march-Raw'!P:P,\"Justified\")","v":0},{"$f":"COUNTIF('march-Raw'!R:R,\"Justified\")","v":1},{"$f":"COUNTIF('march-Raw'!T:T,\"Justified\")","v":1},{"$f":"COUNTIF('march-Raw'!V:V,\"Justified\")","v":0},{"$f":"COUNTIF('march-Raw'!X:X,\"Justified\")","v":1},{"$f":"COUNTIF('march-Raw'!Z:Z,\"Justified\")","v":0},{"$f":"COUNTIF('march-Raw'!AB:AB,\"Justified\")","v":0},{"$f":"COUNTIF('march-Raw'!AD:AD,\"Justified\")","v":0},{"$f":"COUNTIF('march-Raw'!AF:AF,\"Justified\")","v":0},{"$f":"COUNTIF('march-Raw'!AH:AH,\"Justified\")","v":0},{"$f":"COUNTIF('march-Raw'!AJ:AJ,\"Justified\")","v":0},{"$f":"COUNTIF('march-Raw'!AL:AL,\"Justified\")","v":0},{"$f":"COUNTIF('march-Raw'!AN:AN,\"Justified\")","v":0},{"$f":"COUNTIF('march-Raw'!AP:AP,\"Justified\")","v":0},{"$f":"COUNTIF('march-Raw'!AR:AR,\"Justified\")","v":0},{"$f":"COUNTIF('march-Raw'!AT:AT,\"Justified\")","v":0},{"$f":"COUNTIF('march-Raw'!AV:AV,\"Justified\")","v":0},{"$f":"COUNTIF('march-Raw'!AX:AX,\"Justified\")","v":0},{"$f":"COUNTIF('march-Raw'!AZ:AZ,\"Justified\")","v":0},{"$f":"COUNTIF('march-Raw'!BB:BB,\"Justified\")","v":0},{"$f":"COUNTIF('march-Raw'!BD:BD,\"Justified\")","v":0},{"$f":"COUNTIF('march-Raw'!BF:BF,\"Justified\")","v":0},{"$f":"COUNTIF('march-Raw'!BH:BH,\"Justified\")","v":0},{"$f":"COUNTIF('march-Raw'!BJ:BJ,\"Justified\")","v":0},{"$f":"COUNTIF('march-Raw'!BL:BL,\"Justified\")","v":0},{"$f":"COUNTIF('march-Raw'!BN:BN,\"Justified\")","v":0},{"$f":"COUNTIF('march-Raw'!BP:BP,\"Justified\")","v":0},{"$f":"COUNTIF('march-Raw'!BR:BR,\"Justified\")","v":0},{"$f":"COUNTIF('march-Raw'!BT:BT,\"Justified\")","v":0},{"$f":"COUNTIF('march-Raw'!BV:BV,\"Justified\")","v":0},{"$f":"COUNTIF('march-Raw'!BX:BX,\"Justified\")","v":0},{"$f":"COUNTIF('march-Raw'!BZ:BZ,\"Justified\")","v":0},{"$f":"COUNTIF('march-Raw'!CB:CB,\"Justified\")","v":0},{"$f":"COUNTIF('march-Raw'!CD:CD,\"Justified\")","v":0},{"$f":"COUNTIF('march-Raw'!CF:CF,\"Justified\")","v":0},{"$f":"COUNTIF('march-Raw'!CH:CH,\"Justified\")","v":0}]
["Total NA",{"$f":"COUNTIF('march-Raw'!H:H,\"NA\")","v":0},{"$f":"COUNTIF('march-Raw'!J:J,\"NA\")","v":0},{"$f":"COUNTIF('march-Raw'!L:L,\"NA\")","v":0},{"$f":"COUNTIF('march-Raw'!N:N,\"NA\")","v":0},{"$f":"COUNTIF('march-Raw'!P:P,\"NA\")","v":0},{"$f":"COUNTIF('march-Raw'!R:R,\"NA\")","v":0},{"$f":"COUNTIF('march-Raw'!T:T,\"NA\")","v":0},{"$f":"COUNTIF('march-Raw'!V:V,\"NA\")","v":0},{"$f":"COUNTIF('march-Raw'!X:X,\"NA\")","v":0},{"$f":"COUNTIF('march-Raw'!Z:Z,\"NA\")","v":0},{"$f":"COUNTIF('march-Raw'!AB:AB,\"NA\")","v":0},{"$f":"COUNTIF('march-Raw'!AD:AD,\"NA\")","v":0},{"$f":"COUNTIF('march-Raw'!AF:AF,\"NA\")","v":0},{"$f":"COUNTIF('march-Raw'!AH:AH,\"NA\")","v":0},{"$f":"COUNTIF('march-Raw'!AJ:AJ,\"NA\")","v":0},{"$f":"COUNTIF('march-Raw'!AL:AL,\"NA\")","v":0},{"$f":"COUNTIF('march-Raw'!AN:AN,\"NA\")","v":0},{"$f":"COUNTIF('march-Raw'!AP:AP,\"NA\")","v":0},{"$f":"COUNTIF('march-Raw'!AR:AR,\"NA\")","v":0},{"$f":"COUNTIF('march-Raw'!AT:AT,\"NA\")","v":0},{"$f":"COUNTIF('march-Raw'!AV:AV,\"NA\")","v":0},{"$f":"COUNTIF('march-Raw'!AX:AX,\"NA\")","v":0},{"$f":"COUNTIF('march-Raw'!AZ:AZ,\"NA\")","v":0},{"$f":"COUNTIF('march-Raw'!BB:BB,\"NA\")","v":0},{"$f":"COUNTIF('march-Raw'!BD:BD,\"NA\")","v":0},{"$f":"COUNTIF('march-Raw'!BF:BF,\"NA\")","v":0},{"$f":"COUNTIF('march-Raw'!BH:BH,\"NA\")","v":0},{"$f":"COUNTIF('march-Raw'!BJ:BJ,\"NA\")","v":0},{"$f":"COUNTIF('march-Raw'!BL:BL,\"NA\")","v":0},{"$f":"COUNTIF('march-Raw'!BN:BN,\"NA\")","v":0},{"$f":"COUNTIF('march-Raw'!BP:BP,\"NA\")","v":0},{"$f":"COUNTIF('march-Raw'!BR:BR,\"NA\")","v":0},{"$f":"COUNTIF('march-Raw'!BT:BT,\"NA\")","v":0},{"$f":"COUNTIF('march-Raw'!BV:BV,\"NA\")","v":0},{"$f":"COUNTIF('march-Raw'!BX:BX,\"NA\")","v":0},{"$f":"COUNTIF('march-Raw'!BZ:BZ,\"NA\")","v":0},{"$f":"COUNTIF('march-Raw'!CB:CB,\"NA\")","v":0},{"$f":"COUNTIF('march-Raw'!CD:CD,\"NA\")","v":0},{"$f":"COUNTIF('march-Raw'!CF:CF,\"NA\")","v":0},{"$f":"COUNTIF('march-Raw'!CH:CH,\"NA\")","v":0}]
["Blanks",{"$f":"B8-(SUM(B3:B6))","v":0},{"$f":"C8-(SUM(C3:C6))","v":0},0,0,0,0,0,0,0,0,0,3,3,3,3,3,3,3,3,3,3,3,3,3,3,3,3,3,3,3,3,3,3,3,3,3,3,3,3,3]
["full sample size",{"$f":"COUNTA('march-Raw'!A:A)-2","v":3},{"$f":"B8","v":3},3,3,3,3,3,3,3,3,3,3,3,3,3,3,3,3,3,3,3,3,3,3,3,3,3,3,3,3,3,3,3,3,3,3,3,3,3,3]
["True sample size (-NA + blanks)",{"$f":"IF(ISERROR(B8-(B6+B7)),\"\",B8-(B6+B7))","v":3},{"$f":"IF(ISERROR(C8-(C6+C7)),\"\",C8-(C6+C7))","v":3},3,3,3,3,3,3,3,3,3,0,0,0,0,0,0,0,0,0,0,0,0,0,0,0,0,0,0,0,0,0,0,0,0,0,0,0,0,0]
["%Y",{"$f":"IF(ISERROR(B3/B9),\"\",B3/B9)","v":1},{"$f":"IF(ISERROR(C3/C9),\"\",C3/C9)","v":1},0.66666666666666663,1,1,0.66666666666666663,0.66666666666666663,1,0.66666666666666663,1,1,"","","","","","","","","","","","","","","","","","","","","","","","","","","","",""]
["%N",{"$f":"IF(ISERROR(B4/B9),\"\",B4/B9)","v":0},{"$f":"IF(ISERROR(C4/C9),\"\",C4/C9)","v":0},0.33333333333333331,0,0,0,0,0,0,0,0,"","","","","","","","","","","","","","","","","","","","","","","","","","","","",""]
["%N - Justified",{"$f":"IF(ISERROR(B5/B9),\"\",B5/B9)","v":0},{"$f":"IF(ISERROR(C5/C9),\"\",C5/C9)","v":0},0,0,0,0.33333333333333331,0.33333333333333331,0,0.33333333333333331,0,0,"","","","","","","","","","","","","","","","","","","","","","","","","","","","",""]

{"sheet":"Q","index":43,"n_rows":12,"n_cols":2,"rows_kept":12,"cut":false,"hidden":true,"merged":[]}
["Questions","Target"]
["Was a Room number documented?"]
["Were stage A checks completed as appropriate?"]
["Was COSI Part 1 performed?"]
["Was PVP documented?"]
["Was Otoscopy documented?"]
["Document bc at 3 & 4kHz is for programming purposes?"]
["Was Speech testing performed?"]
["Is it documented whether national criteria were/were not met?"]
["Was a BCHI info pack supplied?"]
["Was the report authorised & issued within target (7 days)?"]
["Was consent documented as appropriate?"]

{"sheet":"Math","index":44,"n_rows":51,"n_cols":6,"rows_kept":51,"cut":false,"hidden":true,"merged":[]}
["Audit ID","Audit Name",null,null,null,"Selection list"]
["Audit 1",{"$f":"Questions!B1","v":"Review audit"},null,null,null,"Yes"]
["Audit 2",{"$f":"Questions!D1","v":"BCHI - Assessments"},null,null,null,"No"]
["Audit 3",{"$f":"Questions!F1","v":"Filler 3"},null,null,null,"Justified"]
["Audit 4",{"$f":"Questions!H1","v":"Filler 4"},null,null,null,"NA"]
["Audit 5",{"$f":"Questions!J1","v":"Filler 5"}]
["Audit 6",{"$f":"Questions!L1","v":"Filler 6"}]
["Audit 7",{"$f":"Questions!N1","v":"Filler 7"}]
["Audit 8",{"$f":"Questions!P1","v":"Filler 8"}]
["Audit 9",{"$f":"Questions!R1","v":"Filler 9"}]
["Audit 10",{"$f":"Questions!T1","v":"Filler 10"}]
["Audit 11",{"$f":"Questions!V1","v":"Filler 11"}]
["Audit 12",{"$f":"Questions!X1","v":"Filler 12"}]
["Audit 13",{"$f":"Questions!Z1","v":"Filler 13"}]
["Audit 14",{"$f":"Questions!AB1","v":"Filler 14"}]
["Audit 15",{"$f":"Questions!AD1","v":"Filler 15"}]
["Audit 16",{"$f":"Questions!AF1","v":"Filler 16"}]
["Audit 17",{"$f":"Questions!AH1","v":"Filler 17"}]
["Audit 18",{"$f":"Questions!AJ1","v":"Filler 18"}]
["Audit 19",{"$f":"Questions!AL1","v":"Filler 19"}]
["Audit 20",{"$f":"Questions!AN1","v":"Filler 20"}]
["Audit 21",{"$f":"Questions!AP1","v":"Filler 21"}]
["Audit 22",{"$f":"Questions!AR1","v":"Filler 22"}]
["Audit 23",{"$f":"Questions!AT1","v":"Filler 23"}]
["Audit 24",{"$f":"Questions!AV1","v":"Filler 24"}]
["Audit 25",{"$f":"Questions!AX1","v":"Filler 25"}]
["Audit 26",{"$f":"Questions!AZ1","v":"Filler 26"}]
["Audit 27",{"$f":"Questions!BB1","v":"Filler 27"}]
["Audit 28",{"$f":"Questions!BD1","v":"Filler 28"}]
["Audit 29",{"$f":"Questions!BF1","v":"Filler 29"}]
["Audit 30",{"$f":"Questions!BH1","v":"Filler 30"}]
["Audit 31",{"$f":"Questions!BJ1","v":"Filler 31"}]
["Audit 32",{"$f":"Questions!BL1","v":"Filler 32"}]
["Audit 33",{"$f":"Questions!BN1","v":"Filler 33"}]
["Audit 34",{"$f":"Questions!BP1","v":"Filler 34"}]
["Audit 35",{"$f":"Questions!BR1","v":"Filler 35"}]
["Audit 36",{"$f":"Questions!BT1","v":"Filler 36"}]
["Audit 37",{"$f":"Questions!BV1","v":"Filler 37"}]
["Audit 38",{"$f":"Questions!BX1","v":"Filler 38"}]
["Audit 39",{"$f":"Questions!BZ1","v":"Filler 39"}]
["Audit 40",{"$f":"Questions!CB1","v":"Filler 40"}]
["Audit 41",{"$f":"Questions!CD1","v":"Filler 41"}]
["Audit 42",{"$f":"Questions!CF1","v":"Filler 42"}]
["Audit 43",{"$f":"Questions!CH1","v":"Filler 43"}]
["Audit 44",{"$f":"Questions!CJ1","v":"Filler 44"}]
["Audit 45",{"$f":"Questions!CL1","v":"Filler 45"}]
["Audit 46",{"$f":"Questions!CN1","v":"Filler 46"}]
["Audit 47",{"$f":"Questions!CP1","v":"Filler 47"}]
["Audit 48",{"$f":"Questions!CR1","v":"Filler 48"}]
["Audit 49",{"$f":"Questions!CT1","v":"Filler 49"}]
["Audit 50",{"$f":"Questions!CV1","v":"Filler 50"}]